{"text_format":"1","workbook":"xlsx","n_sheets":36,"sheets":["Welcome","Guidance","Outcome Table","Sheet1","sheet 1","Source reference list","Screener","(1)","(2-6)","CFW","LTFS","MWDTD","PAFLE","PSA","FC","SO","DE","SSC","EWTF","EWAG","EWM","CFR","WTTAM","FN","UFCAP","KWAAG","BS","ATFP","MEANS","PRESSURE","ATAG","Questions","Output File","Outcome FW","Template","Question numbers"],"not_rendered":{"charts":0,"images":1,"macros":1,"external_links":0,"defined_names":33,"comments":0,"pivot_tables":0},"unopened":[],"bounds":{"document_bytes":16777216,"sheet_cells":100000,"rows_first":2000,"rows_last":500,"rows_between":2000,"halvings":0,"cell_chars":16384,"cell_head_chars":4096},"cells_cut":0,"cells_raw":0,"read":"whole","date_system":"1900"}

{"sheet":"Welcome","index":0,"n_rows":15,"n_cols":3,"rows_kept":15,"cut":false,"hidden":false,"merged":[]}
[]
[]
[]
[]
[]
[]
[]
[null,null,"Adult Outcomes Frameworks"]
[]
[]
[]
[null,null,"Welcome to the Adults Outcomes Frameworks tool"]
[null,null,"Use the buttons below to view guidance, start usting the Outcomes Framework, "]
[null,null,"or view the source reference to see the surveys we sourced questions from."]
[null,null,"Once in the tool, you can navigate back to these sections using buttons on the top of each page"]

{"sheet":"Guidance","index":1,"n_rows":16,"n_cols":2,"rows_kept":16,"cut":false,"hidden":false,"merged":[[8,1,13,11],[51,12,81,21],[15,1,20,11]]}
[]
[]
[]
[]
[]
[]
[]
[]
[null,"How to use the Financial Capability Outcomes Framework for Adults "]
[]
[]
[]
[]
[]
[]
[null,"\n"]

{"sheet":"Outcome Table","index":2,"n_rows":5,"n_cols":13,"rows_kept":5,"cut":false,"hidden":false,"merged":[[4,12,5,71]]}
[]
[]
[]
[]
[null,null,null,null,null,null,null,null,null,null,null,null,"Click on the cells below to see relevant questions. Use the grey buttons on the left to navigate to view the guidance and see all the questions you have selected so far"]

{"sheet":"Sheet1","index":3,"n_rows":0,"n_cols":0,"rows_kept":0,"cut":false,"hidden":false,"merged":[]}

{"sheet":"sheet 1","index":4,"n_rows":0,"n_cols":0,"rows_kept":0,"cut":false,"hidden":true,"merged":[]}

{"sheet":"Source reference list","index":5,"n_rows":38,"n_cols":3,"rows_kept":38,"cut":false,"hidden":false,"merged":[]}
[null,"Question sources"]
[null,"Abbreviation","Survey and documentation"]
[null,"AtP","DWP Attitudes to Pensions: http://doc.ukdataservice.ac.uk/doc/7457/mrdoc/pdf/7457_attitudes_to_pensions_questionnaire_2012.pdf"]
[null,"BASE","Baseline Survey of Financial Capability: http://www.bristol.ac.uk/media-library/sites/geography/migrated/documents/pfrc0604.pdf. See also short instrument, used in Money Guidance: http://www.bristol.ac.uk/media-library/sites/geography/migrated/documents/pfrc1114.pdf"]
[null,"BHPS/USOC","BHPS/Understanding Society: (overview): https://www.understandingsociety.ac.uk/about/questionnaire-content; (detailed LT content overview): https://www.understandingsociety.ac.uk/d/18/Long_Term_Content_Plan_Nov2011-3.pdf?1355920157; (full sets of q’aires): https://www.understandingsociety.ac.uk/documentation/mainstage/questionnaires"]
[null,"BSA","British Social Attitudes Survey: http://discover.ukdataservice.ac.uk/catalogue/?sn=7500&type=Data%20catalogue"]
[null,"CAS","MAS Consumer Action Tracker Survey (not public)"]
[null,"CDS","BIS Consumer detriment survey p.80 https://www.gov.uk/government/uploads/system/uploads/attachment_data/file/319043/bis-14-881-bis-consumer-detriment-survey.pdf"]
[null,"CITA","CitA Quids-in Financial Skills Evaluation (not public)"]
[null,"CommLife","Community Life Web Survey: http://doc.ukdataservice.ac.uk/doc/7738/mrdoc/pdf/7738_community_life_2013-14_web_survey_technical_report.pdf"]
[null,"CPOS","Consumer Purchasing Outcomes Survey 2010 (not public)"]
[null,"CSEW","CSEW (Crime survey) 2014-15 survey: for questions about financial fraud only"]
[null,"DAE","Debt Advice Evaluation Outcomes (not public)"]
[null,"DSK","Digital Skills, Evaluate IT: https://www.digitalskills.com/sites/default/files/2.EvaluateIT_DataCollectionResource.pdf"]
[null,"EB","Eurobarometer (run by GfK in UK): http://ec.europa.eu/public_opinion/archives/eb/eb82/eb82_en.html"]
[null,"EB","Eurobarometer Consumer Empowerment survey http://ec.europa.eu/public_opinion/archives/ebs/ebs_342_en.pdf\nCovers some questions on basic skills (p266-267)"]
[null,"ELSA","English Longitudinal Study of Ageing (ELSA): http://www.elsa-project.ac.uk/documentation"]
[null,"ESS","European Social Survey: http://www.europeansocialsurvey.org/docs/round7/questionnaire/ESS7_source_main_questionnaire_final_alert_03.pdf. See also: http://www.europeansocialsurvey.org/data/"]
[null,"FFH","EagaCT Survey of financial and fuel hardship (pgs46-51): http://www.bristol.ac.uk/media-library/sites/geography/migrated/documents/pfrc1006.pdf (see also question justification document; not public)"]
[null,"Fincap","MAS Financial Capability Survey (not public)"]
[null,"FRS","Family Resources Survey: http://doc.ukdataservice.ac.uk/doc/7753/mrdoc/pdf/frs_2013_14_gb_frs_question_instructions.pdf"]
[null,"Genworth","Genworth Overdinebtedness Index: https://www.genworth.com/dam/Americas/US/PDFs/Consumer/corporate/Technical_Report.pdf"]
[null,"HCC","BIS High Cost Credit: http://www.bristol.ac.uk/media-library/sites/geography/migrated/documents/pfrc1304.pdf"]
[null,"MAC","Macmillan Financial Impacts of Cancer: (pgs47 http://www.bristol.ac.uk/media-library/sites/geography/pfrc/pfrc1211-financial-impacts-methodological-appendix.pdf"]
[null,"MAP","Toynbee Hall MAP Tool"]
[null,"NI L&T ","Northern Ireland Life and Times (2000): http://www.ark.ac.uk/nilt/2000/scb00.PDF "]
[null,"OECD","OECD/INFE 2015 Financial Literacy Survey (pgs15-39*): https://www.oecd.org/daf/fin/financial-education/2015_OECD_INFE_Toolkit_Measuring_Financial_Literacy.pdf"]
[null,"OXIS","Oxford Internet Survey http://oxis.oii.ox.ac.uk/wp-content/uploads/2015/01/OxIS-2011-questionnaire.pdf  - some questions on digital skills"]
[null,"PDL","FCA Pay Day Loans questionnaire (not published)"]
[null,"QOL","European Quality of Life Survey: https://www.eurofound.europa.eu//sites/default/files/ef_files/surveys/eqls/2011/documents/unitedkingdom.pdf"]
[null,"SEG","FSA Consumer Segmentation 2013 http://www.fca-consumer-spotlight.org.uk/sites/default/files/FSA_Segmentation_-_Technical_Report_Survey%20Materials%20redacted%20contacts%2020140815_0.pdf"]
[null,"SILC","EU SILC (2008-10 special module on overindebtedness and financial inclusion) (pgs21-7*): https://circabc.europa.eu/sd/a/1fc037b9-b281-4583-a57b-27f55bed630a/2008 per cent20Questionnaire per cent20UK.pdf"]
[null,"SKILL","Skills for LIfe survey, some questions on basic skills p127-130 https://www.gov.uk/government/uploads/system/uploads/attachment_data/file/36066/12-p168an1-2011-skills-for-life-survey-annexes.pdf"]
[null,"USOC","Understanding Society (see BHPS/USOC above)"]
[null,"WAS","Wealth and Assets Survey 2010-12: http://doc.ukdataservice.ac.uk/doc/6709/mrdoc/pdf/6709wave_3_mainstage_paper_questionnaire_final_version.pdf. See also financial capability mapping document (not public/hard copy only). Plus wave 1 survey (pg35*: http://doc.ukdataservice.ac.uk/doc/6415/mrdoc/pdf/6415_questionnaire_wave1.pdf"]
[null,"WB","World Bank/Russian Federation Financial Capability (pgs72-111*): http://www.finlitedu.org/team-downloads/measurement/measuring-financial-capability-questionnaires-and-implementation-guidance-for-low-and-middle-income-countries.pdf. For precise question wording, uses: http://responsiblefinance.worldbank.org/surveys/demand/exploreeconomies/tajikistan/~/media/GIAWB/FL/Documents/Questionnaire/tajikistan-Questionnaire.pdf"]
[null,"WELLB","ONS Happiness/Wellbeing (nb I can only find the 4 key questions, not a fuller module – I think the others may be taken from different sources) (pgs23-4*): http://doc.ukdataservice.ac.uk/doc/7742/mrdoc/pdf/lfs_user_guide_vol2_questionnaire2015.pdf (nb I can only find the 4 key questions, not a fuller module – I think the others may be taken from different sources: http://www.ons.gov.uk/ons/publications/re-reference-tables.html?edition=tcm%3A77-391358)"]
[null,"WMEWS","Short Warwick Mental-Edinburgh Wellbeing Scale: http://www.healthscotland.com/uploads/documents/14092-SWEMWBSSept2007.pdf "]

{"sheet":"Screener","index":6,"n_rows":29,"n_cols":18,"rows_kept":29,"cut":false,"hidden":true,"merged":[]}
[]
[]
[null,null,null,null,null,null,null,null,null,null,null,null,null,null,null,null,true,true]
[null,null,null,null,null,null,null,null,null,null,null,null,null,null,null,null,true,true]
[]
[]
[]
[null,null,"Adult Outcome Frameworks"]
[null,null,"How to use this tool: Tick 'include' to view outcomes in the areas that are relevant to your intervention. "]
[null,null,"Click 'next' to see a table of outcomes that relate to each of the four outcome areas (listed below) you have selected. "]
[]
[]
[]
[]
[]
[]
[]
[null,null,"Managing well day to day",null,null,null,"Include:",null,null,"Planning for life events",null,null,null,"Include:"]
[null,null,"Keeping track and managing your income",null,null,null,null,null,null,"Saving regularly or for the future having goals and insurance"]
[]
[]
[]
[]
[]
[]
[]
[]
[null,null,"Credit / Debt",null,null,null,"Include:",null,null,"Advice / Guidance",null,null,null,"Include:"]
[null,null,"Reducing debt and using credit responsibly ",null,null,null,null,null,null,"Actively seeking advice, awareness of providers"]

{"sheet":"(1)","index":7,"n_rows":8,"n_cols":7,"rows_kept":8,"cut":false,"hidden":true,"merged":[[6,6,6,7]]}
[]
[null,null,"Adult Outcome Frameworks"]
[]
[null,"Current Financial Wellbeing"]
[null,"Select the questions that are relevant to your intervention -  use the first question for each indicator, "]
[null,"only use additional questions if that indicator is particularly important."]
[null,"Higher level outcome","Lower level outcome","Indicator","Question","Building Block Y/N","Question"]
[null,"Current financial wellbeing","Able to live (adequately) within means","Satisfaction with financial circumstances ","How satisfied are you with your overall financial circumstances? \n\nPlease answer on a scale of 0 to 10, where 0 is ‘not at all satisfied’ and 10 is ‘completely satisfied’ \n\n0 Not at all satisfied\n10 Completely satisfied\nDon’t know","Y",1]

{"sheet":"(2-6)","index":8,"n_rows":12,"n_cols":7,"rows_kept":12,"cut":false,"hidden":true,"merged":[[6,6,6,7]]}
[]
[null,null,"Adult Outcome Frameworks"]
[]
[null,"Current Financial Wellbeing"]
[null,"Select the questions that are relevant to your intervention -  use the first question for each indicator, "]
[null,"only use additional questions if that indicator is particularly important."]
[null,"Higher level outcome","Lower level outcome","Indicator","Question","Building Block Y/N","Question"]
[null,"Current financial wellbeing","Able to live (adequately) within means","Regularity of running out of money ","How often do you and your household run out of money before the end of the week or month or needed to use a credit card or overdraft to get by? Would you say it was ...\n1. Always\n2. Most of the time\n3. Sometimes\n4. Hardly ever\n5. Never\n6. Don’t know","N",2]
[null,"Current financial wellbeing","Able to keep up with bills ","Self-reported keeping up with bills and commitments","Which one of the following statements best describes how well you are keeping up with your bills and credit commitments at the moment? [Please include those you have personally or jointly with your partner/spouse]\nCHOOSE ONE ONLY\n1. Keeping up without any difficulties\n2. It is a struggle from time to time \n3. It is a constant struggle\n4. Falling behind with some bills or credit commitments\n5. Having real financial problems and have fallen behind with many bills or credit commitments  \n6. Don’t have any bills or credit commitments\n7. Don't know\n8. Prefer not to say","Y",3]
[null,"Current financial wellbeing","Bills / credit commitments are not a burden ","Self-reported burden of bills and commitments","To what extent do you feel that keeping up with your bills and credit commitments is a burden?\n1. It is not a burden at all\n2. It is somewhat of a burden \n3. It is a heavy burden\n4. Don't know\n","Y",4]
[null,"Current financial wellbeing","Not experiencing material deprivation","Regularity of being unable to pay for essentials ","How often do you and your household go without essential items due to a lack of money? This might include being unable to pay bills, buy food or pay for heating.\n1. Always\n2. Most of the time\n3. Sometimes\n4. Hardly ever\n5. Never\n6. Don’t know","N",5]
[null,"Current financial wellbeing","Not experiencing material deprivation","Number of expenses considered affordable","Looking at this list, can I just check whether your household could afford the following things? \nCHOOSE ALL THAT APPLY\n1. A week's annual holiday away from home\n2. Buying new, rather than second hand, clothes\n3. Keeping your home adequately warm in winter\n4. Having friends or family for a drink or meal once a month\n5. Going out or socialising\n6. A hobby or leisure activity\n7. Replacing a major electrical appliance (e.g. fridge)\n8. Keeping your home in a decent state of decoration\n9. None of these (SINGLE CODE ONLY)","N",6]

{"sheet":"CFW","index":9,"n_rows":18,"n_cols":7,"rows_kept":18,"cut":false,"hidden":false,"merged":[[6,6,6,7]]}
[]
[null,null,"Adult Outcome Frameworks"]
[]
[null,"Financial Wellbeing - Current Financial Wellbeing"]
[null,"Select the questions that are relevant to your intervention -  use the first question for each indicator, "]
[null,"only use additional questions if that indicator is particularly important."]
[null,"Higher level outcome","Lower level outcome","Indicator","Question","Building Block Y/N","Question"]
[null,{"$f":"INDEX(Questions!E:K,MATCH(CFW!G8,Questions!F:F,0),3)","v":"Current financial wellbeing"},{"$f":"INDEX(Questions!E:K,MATCH(CFW!G8,Questions!F:F,0),4)","v":"Able to live (adequately) within means"},{"$f":"INDEX(Questions!E:K,MATCH(CFW!G8,Questions!F:F,0),5)","v":"Satisfaction with financial circumstances "},{"$f":"INDEX(Questions!E:K,MATCH(CFW!G8,Questions!F:F,0),7)","v":"How satisfied are you with your overall financial circumstances? \n\nPlease answer on a scale of 0 to 10, where 0 is ‘not at all satisfied’ and 10 is ‘completely satisfied’ \n\n0 Not at all satisfied\n...\n10 Completely satisfied\nDon’t know"},{"$f":"INDEX(Questions!E:K,MATCH(CFW!G8,Questions!F:F,0),1)","v":"Y"},1]
[null,{"$f":"INDEX(Questions!E:K,MATCH(CFW!G9,Questions!F:F,0),3)","v":"Current financial wellbeing"},{"$f":"INDEX(Questions!E:K,MATCH(CFW!G9,Questions!F:F,0),4)","v":"Able to live (adequately) within means"},{"$f":"INDEX(Questions!E:K,MATCH(CFW!G9,Questions!F:F,0),5)","v":"Regularity of running out of money "},{"$f":"INDEX(Questions!E:K,MATCH(CFW!G9,Questions!F:F,0),7)","v":"How often do you and your household run out of money before the end of the week or month or needed to use a credit card or overdraft to get by? Would you say it was …\n\n1. Always\n2. Most of the time\n3. Sometimes\n4. Hardly ever\n5. Never\n6. Don’t know"},{"$f":"INDEX(Questions!E:K,MATCH(CFW!G9,Questions!F:F,0),1)","v":"N"},2]
[null,{"$f":"INDEX(Questions!E:K,MATCH(CFW!G10,Questions!F:F,0),3)","v":"Current financial wellbeing"},{"$f":"INDEX(Questions!E:K,MATCH(CFW!G10,Questions!F:F,0),4)","v":"Keeping up with bills and commitments"},{"$f":"INDEX(Questions!E:K,MATCH(CFW!G10,Questions!F:F,0),5)","v":"Self-reported keeping up with bills and commitments"},{"$f":"INDEX(Questions!E:K,MATCH(CFW!G10,Questions!F:F,0),7)","v":"Which one of the following statements best describes how well you are keeping up with your bills and credit commitments at the moment? [Please include those you have personally or jointly with your partner/spouse]\nCHOOSE ONE ONLY\n\n1. Keeping up without any difficulties\n2. It is a struggle from time to time \n3. It is a constant struggle\n4. Falling behind with some bills or credit commitments\n5. Having real financial problems and have fallen behind with many bills or credit commitments  \n6. Don’t have any bills or credit commitments\n7. Don't know\n8. Prefer not to say"},{"$f":"INDEX(Questions!E:K,MATCH(CFW!G10,Questions!F:F,0),1)","v":"Y"},3]
[null,{"$f":"INDEX(Questions!E:K,MATCH(CFW!G11,Questions!F:F,0),3)","v":"Current financial wellbeing"},{"$f":"INDEX(Questions!E:K,MATCH(CFW!G11,Questions!F:F,0),4)","v":"Keeping up with bills or credit commitments"},{"$f":"INDEX(Questions!E:K,MATCH(CFW!G11,Questions!F:F,0),5)","v":0},{"$f":"INDEX(Questions!E:K,MATCH(CFW!G11,Questions!F:F,0),7)","v":"How often do you/your household have any money left over after you’ve paid for food and other bills?\n\n1. Very often\n2. Fairly often\n3. Sometimes\n4. Not very often\n5. Never\n6. Don’t know\n"},{"$f":"INDEX(Questions!E:K,MATCH(CFW!G11,Questions!F:F,0),1)","v":"Y"},9]
[null,{"$f":"INDEX(Questions!E:K,MATCH(CFW!G12,Questions!F:F,0),3)","v":"Current financial wellbeing"},{"$f":"INDEX(Questions!E:K,MATCH(CFW!G12,Questions!F:F,0),4)","v":"Burden of bills or credit commitments"},{"$f":"INDEX(Questions!E:K,MATCH(CFW!G12,Questions!F:F,0),5)","v":"Self-reported burden of bills and commitments"},{"$f":"INDEX(Questions!E:K,MATCH(CFW!G12,Questions!F:F,0),7)","v":"To what extent do you feel that keeping up with your bills and credit commitments is a burden?\n\n1. It is not a burden at all\n2. It is somewhat of a burden \n3. It is a heavy burden\n4. Don't know\n"},{"$f":"INDEX(Questions!E:K,MATCH(CFW!G12,Questions!F:F,0),1)","v":"Y"},4]
[null,{"$f":"INDEX(Questions!E:K,MATCH(CFW!G13,Questions!F:F,0),3)","v":"Current financial wellbeing"},{"$f":"INDEX(Questions!E:K,MATCH(CFW!G13,Questions!F:F,0),4)","v":"Burden of bills or credit commitments"},{"$f":"INDEX(Questions!E:K,MATCH(CFW!G13,Questions!F:F,0),5)","v":"Self-reported burden of bills and commitments"},{"$f":"INDEX(Questions!E:K,MATCH(CFW!G13,Questions!F:F,0),7)","v":"In the last 6 months, have you fallen behind on, or missed, any payments for credit commitments or domestic bills for any 3 or more months? These 3 months don’t necessarily have to be consecutive months. \n\n1. Yes \n2. No \n3. Don’t know"},{"$f":"INDEX(Questions!E:K,MATCH(CFW!G13,Questions!F:F,0),1)","v":"Y"},5]
[null,{"$f":"INDEX(Questions!E:K,MATCH(CFW!G14,Questions!F:F,0),3)","v":"Current financial wellbeing"},{"$f":"INDEX(Questions!E:K,MATCH(CFW!G14,Questions!F:F,0),4)","v":"Not experiencing material deprivation"},{"$f":"INDEX(Questions!E:K,MATCH(CFW!G14,Questions!F:F,0),5)","v":"Regularity of being unable to pay for essentials "},{"$f":"INDEX(Questions!E:K,MATCH(CFW!G14,Questions!F:F,0),7)","v":"How often do you and your household go without essential items due to a lack of money? This might include being unable to pay bills, buy food or pay for heating.\n\n1. Always\n2. Most of the time\n3. Sometimes\n4. Hardly ever\n5. Never\n6. Don’t know"},{"$f":"INDEX(Questions!E:K,MATCH(CFW!G14,Questions!F:F,0),1)","v":"N"},6]
[null,{"$f":"INDEX(Questions!E:K,MATCH(CFW!G15,Questions!F:F,0),3)","v":"Current financial wellbeing"},{"$f":"INDEX(Questions!E:K,MATCH(CFW!G15,Questions!F:F,0),4)","v":"Not experiencing material deprivation"},{"$f":"INDEX(Questions!E:K,MATCH(CFW!G15,Questions!F:F,0),5)","v":"Number of expenses considered affordable"},{"$f":"INDEX(Questions!E:K,MATCH(CFW!G15,Questions!F:F,0),7)","v":"Looking at this list, can I just check whether your household could afford the following things? \nCHOOSE ALL THAT APPLY\n\n1. A week's annual holiday away from home\n2. Buying new, rather than second hand, clothes\n3. Keeping your home adequately warm in winter\n4. Having friends or family for a drink or meal once a month\n5. Going out or socialising\n6. A hobby or leisure activity\n7. Replacing a major electrical appliance (e.g. fridge)\n8. Keeping your home in a decent state of decoration\n9. None of these (SINGLE CODE ONLY)"},{"$f":"INDEX(Questions!E:K,MATCH(CFW!G15,Questions!F:F,0),1)","v":"N"},7]
[null,{"$f":"INDEX(Questions!E:K,MATCH(CFW!G16,Questions!F:F,0),3)","v":"Current financial wellbeing"},{"$f":"INDEX(Questions!E:K,MATCH(CFW!G16,Questions!F:F,0),4)","v":"Ability to pay unexpected bills"},{"$f":"INDEX(Questions!E:K,MATCH(CFW!G16,Questions!F:F,0),5)","v":"How would pay an unexpected bill of £300"},{"$f":"INDEX(Questions!E:K,MATCH(CFW!G16,Questions!F:F,0),7)","v":"Which, if any of the following would you do to pay a bill of £300?\nIf you think you would do more than one, please select the main thing you would do,that is the one you would get the most money from.\nPLEASE SELECT ONE ONLY\n\n1. pay it with my/our own money, without dipping into savings or cutting back on essentials\n2. pay it with my/our own money, without dipping into savings but I/we would have to cut back on essentials\n3. dip into savings\n4. use a form of credit (e.g. credit card, take out a loan or make use of an authorisedoverdraft facility)\n5. go overdrawn without authorisation\n6. get the money from friends or family as gift or loan\n7. sell personal/household item(s) to get the money\n8. couldn’t pay this bill\n9. Don’t know\n10. Prefer not to say"},{"$f":"INDEX(Questions!E:K,MATCH(CFW!G16,Questions!F:F,0),1)","v":"Y"},8]
[null,{"$f":"INDEX(Questions!E:K,MATCH(CFW!G17,Questions!F:F,0),3)","v":"Current financial wellbeing"},{"$f":"INDEX(Questions!E:K,MATCH(CFW!G17,Questions!F:F,0),4)","v":"Finances and emotional wellbeing"},{"$f":"INDEX(Questions!E:K,MATCH(CFW!G17,Questions!F:F,0),5)","v":"Thinking about finances causes anxiety"},{"$f":"INDEX(Questions!E:K,MATCH(CFW!G17,Questions!F:F,0),7)","v":"To what extent do you agree or disagree with the following statement?\n\nThinking about my financial situation makes me anxious\n\n1. Strongly agree\n2. Tend to agree\n3. Neither agree nor disagree\n4. Tend to disagree\n5. Strongly disagree\n6. Don’t know"},{"$f":"INDEX(Questions!E:K,MATCH(CFW!G17,Questions!F:F,0),1)","v":"Y"},10]
[null,{"$f":"INDEX(Questions!E:K,MATCH(CFW!G18,Questions!F:F,0),3)","v":"Current financial wellbeing"},{"$f":"INDEX(Questions!E:K,MATCH(CFW!G18,Questions!F:F,0),4)","v":"Finances and emotional/mental wellbeing"},{"$f":"INDEX(Questions!E:K,MATCH(CFW!G18,Questions!F:F,0),5)","v":"Effect of finances on mental health "},{"$f":"INDEX(Questions!E:K,MATCH(CFW!G18,Questions!F:F,0),7)","v":"A) To what extent, if at all, do you worry about your current financial situation?\nCHOOSE ONE ONLY\n\n1. Worry a great deal\n2. Worry to some extent \n3. Worry a little \n4. Don’t worry at all \n5. Don’t know\n\nB) And which of these do you experience because of your or your household's financial situation?\n\n1. Stress or anxiety\n2. Low mood or depression\n3. Self-harm or suicidal thoughts\n4. Difficulty concentrating or relaxing\n5. Difficulty sleeping\n6. Panic attacks\n7. Family tension or arguments\n8. Domestic abuse or violence\n9. Poor/loss of appetite or eating too much\n10. Increased use of alcohol \n11. Misuse of prescription or over-the-counter drugs\n12. Use of illicit (illegal) drugs or legal highs\n13. Other (specify) \n14. Not experienced any of these\n15. Prefer not to say\n16. Don't know\n"},{"$f":"INDEX(Questions!E:K,MATCH(CFW!G18,Questions!F:F,0),1)","v":"N"},21]

{"sheet":"LTFS","index":10,"n_rows":15,"n_cols":7,"rows_kept":15,"cut":false,"hidden":false,"merged":[[6,6,6,7]]}
[]
[null,null,"Adult Outcome Frameworks"]
[]
[null,"Financial Wellbeing - Longer-Term Financial Security"]
[null,"Select the questions that are relevant to your intervention -  use the first question for each indicator, "]
[null,"only use additional questions if that indicator is particularly important."]
[null,"Higher level outcome","Lower level outcome","Indicator","Question","Building Block Y/N","Question"]
[null,{"$f":"INDEX(Questions!E:K,MATCH(LTFS!G8,Questions!F:F,0),3)","v":"Longer term financial security"},{"$f":"INDEX(Questions!E:K,MATCH(LTFS!G8,Questions!F:F,0),4)","v":"Able to withstand a significant financial shock "},{"$f":"INDEX(Questions!E:K,MATCH(LTFS!G8,Questions!F:F,0),5)","v":"Number of weeks the household could cover living expenses"},{"$f":"INDEX(Questions!E:K,MATCH(LTFS!G8,Questions!F:F,0),7)","v":"If you lost your main source of household income, how long could your household continue to cover living expenses, without having to borrow any money or ask for help from friends or family? \n\n1. Less than a week \n2. 1 week to less than 1 month \n3. 1 month to less than 3 months \n4. 3 months to less than 6 months \n5. 6 months or longer \n6. Don’t know \n7. Refused"},{"$f":"INDEX(Questions!E:K,MATCH(LTFS!G8,Questions!F:F,0),1)","v":"Y"},11]
[null,{"$f":"INDEX(Questions!E:K,MATCH(LTFS!G9,Questions!F:F,0),3)","v":"Longer term financial security"},{"$f":"INDEX(Questions!E:K,MATCH(LTFS!G9,Questions!F:F,0),4)","v":"Able to withstand a significant financial shock "},{"$f":"INDEX(Questions!E:K,MATCH(LTFS!G9,Questions!F:F,0),5)","v":"Biggest unexpected bill the household could pay"},{"$f":"INDEX(Questions!E:K,MATCH(LTFS!G9,Questions!F:F,0),7)","v":"Imagine to pay an unexpected bill within the next seven days from today. What is the biggest bill could pay, either from money you already have, or money you could easily borrow in a way that you consider affordable? If you don’t know the exact amount your best guess is fine. \n\n1. None – I couldn’t pay an unexpected bill \n2. £50 \n3. £100 \n4. £300 \n5. £500 \n6. £1,000 \n7. £2,500 \n8. £5,000 \n9. £10,000 \n10. Don’t know \n11. Prefer not to say"},{"$f":"INDEX(Questions!E:K,MATCH(LTFS!G9,Questions!F:F,0),1)","v":"Y"},12]
[null,{"$f":"INDEX(Questions!E:K,MATCH(LTFS!G10,Questions!F:F,0),3)","v":"Longer term financial security"},{"$f":"INDEX(Questions!E:K,MATCH(LTFS!G10,Questions!F:F,0),4)","v":"Able to withstand a significant financial shock "},{"$f":"INDEX(Questions!E:K,MATCH(LTFS!G10,Questions!F:F,0),5)","v":"Count of home (contents or buildings) and life insurance"},{"$f":"INDEX(Questions!E:K,MATCH(LTFS!G10,Questions!F:F,0),7)","v":"Does your household have….?\nPLEASE SELECT ALL THAT APPLY \n\n1. Home insurance - buildings (Cover for the building you live in)\n2. Home insurance - contents (Cover for the contents of your home)\n3. Life insurance (A life insurance policy which might be for a limited period (often sold alongside a mortgage) or for the whole of your life)\n4. Death in service (A benefit from your employer that would pay out in the event of your death)"},{"$f":"INDEX(Questions!E:K,MATCH(LTFS!G10,Questions!F:F,0),1)","v":"Y"},17]
[null,{"$f":"INDEX(Questions!E:K,MATCH(LTFS!G11,Questions!F:F,0),3)","v":"Longer term financial security"},{"$f":"INDEX(Questions!E:K,MATCH(LTFS!G11,Questions!F:F,0),4)","v":"Able to withstand a significant financial shock "},{"$f":"INDEX(Questions!E:K,MATCH(LTFS!G11,Questions!F:F,0),5)","v":"Number of insurance and protection products"},{"$f":"INDEX(Questions!E:K,MATCH(LTFS!G11,Questions!F:F,0),7)","v":"Which, if any, of the following protection products do you and your partner/spouse have, even if you didn't arrange them yourself? \nCHOOSE ALL THAT APPLY\n\n1. Insurance for specific items (e.g. white goods, mobile phone)\n2. Payment protection insurance (e.g. for a credit card or mortgage)\n3. Private Medical Insurance (paying or part-paying private hospital or specialist health care)\n4. Critical illness Insurance (paying a lump sum if you become seriously ill)\n5. Income protection insurance  (providing regular payments if you cannot work due to ill health or accident)\n6. Another type of insurance\n7. Funeral plan\n8. None of these "},{"$f":"INDEX(Questions!E:K,MATCH(LTFS!G11,Questions!F:F,0),1)","v":"N"},14]
[null,{"$f":"INDEX(Questions!E:K,MATCH(LTFS!G12,Questions!F:F,0),3)","v":"Longer term financial security"},{"$f":"INDEX(Questions!E:K,MATCH(LTFS!G12,Questions!F:F,0),4)","v":"Able to withstand a significant financial shock "},{"$f":"INDEX(Questions!E:K,MATCH(LTFS!G12,Questions!F:F,0),5)","v":"Ratio of savings to income"},{"$f":"INDEX(Questions!E:K,MATCH(LTFS!G12,Questions!F:F,0),7)","v":"See means section of framework for savings and income questions"},{"$f":"INDEX(Questions!E:K,MATCH(LTFS!G12,Questions!F:F,0),1)","v":"Y"},13]
[null,{"$f":"INDEX(Questions!E:K,MATCH(LTFS!G13,Questions!F:F,0),3)","v":"Longer term financial security"},{"$f":"INDEX(Questions!E:K,MATCH(LTFS!G13,Questions!F:F,0),4)","v":"Able to withstand a significant financial shock "},{"$f":"INDEX(Questions!E:K,MATCH(LTFS!G13,Questions!F:F,0),5)","v":"Number of longer-term savings products held "},{"$f":"INDEX(Questions!E:K,MATCH(LTFS!G13,Questions!F:F,0),7)","v":"Do you currently have savings or investments in any of the following? Please do not include any money that you have saved in a pension. \n\n1. In a savings account \n2. In an ISA\n3. In a cash / money box\n4. In a credit union account\n5. In a savings club (e.g. Christmas savings club)\n6. Premium bonds\n7. In a current account\n8. In investments/stocks & shares\n9. Other (please specify) \n10. I do not have any savings (SINGLE CODE ONLY)\n11. Prefer not to say (SINGLE CODE ONLY)"},{"$f":"INDEX(Questions!E:K,MATCH(LTFS!G13,Questions!F:F,0),1)","v":"Y"},15]
[null,{"$f":"INDEX(Questions!E:K,MATCH(LTFS!G14,Questions!F:F,0),3)","v":"Longer term financial security"},{"$f":"INDEX(Questions!E:K,MATCH(LTFS!G14,Questions!F:F,0),4)","v":"Whether has a will"},{"$f":"INDEX(Questions!E:K,MATCH(LTFS!G14,Questions!F:F,0),5)","v":0},{"$f":"INDEX(Questions!E:K,MATCH(LTFS!G14,Questions!F:F,0),7)","v":"Do you have a will? \n\n1. Yes \n2. No \n3. Don’t know \n4. Prefer not to say"},{"$f":"INDEX(Questions!E:K,MATCH(LTFS!G14,Questions!F:F,0),1)","v":"Y"},16]
[null,{"$f":"INDEX(Questions!E:K,MATCH(LTFS!G15,Questions!F:F,0),3)","v":"Longer term financial wellbeing"},{"$f":"INDEX(Questions!E:K,MATCH(LTFS!G15,Questions!F:F,0),4)","v":"Confident about financial future"},{"$f":"INDEX(Questions!E:K,MATCH(LTFS!G15,Questions!F:F,0),5)","v":"Level of confidence in future finances "},{"$f":"INDEX(Questions!E:K,MATCH(LTFS!G15,Questions!F:F,0),7)","v":"Taking everything into account, how confident are you that you will have enough money to give you the standard of living you hope for in a year from now?\nCHOOSE ONE ONLY\n\n1. Very confident\n2. Fairly confident\n3. Not very confident\n4. Not at all confident\n5. Don’t know"},{"$f":"INDEX(Questions!E:K,MATCH(LTFS!G15,Questions!F:F,0),1)","v":"N"},22]

{"sheet":"MWDTD","index":11,"n_rows":31,"n_cols":7,"rows_kept":31,"cut":false,"hidden":false,"merged":[[6,6,6,7]]}
[]
[null,null,"Adult Outcome Frameworks"]
[]
[null,"Behaviours - Managing Money Well Day-To-Day"]
[null,"Select the questions that are relevant to your intervention -  use the first question for each indicator, "]
[null,"only use additional questions if that indicator is particularly important."]
[null,"Higher level outcome","Lower level outcome","Indicator","Question","Building Block Y/N","Question"]
[null,{"$f":"INDEX(Questions!E:K,MATCH(MWDTD!G8,Questions!F:F,0),3)","v":"Managing credit use"},{"$f":"INDEX(Questions!E:K,MATCH(MWDTD!G8,Questions!F:F,0),4)","v":"Reducing the value of unsecured borrowing"},{"$f":"INDEX(Questions!E:K,MATCH(MWDTD!G8,Questions!F:F,0),5)","v":"Total unsecured borrowing"},{"$f":"INDEX(Questions!E:K,MATCH(MWDTD!G8,Questions!F:F,0),7)","v":"If you added up all of balances on overdrafts, credit cards, store cards, personal loans, hire purchase, car finance arrangements, approximately how much do you owe in total? Please exclude any mortgages or other loans secured on property. Please exclude any loans from the Student Loan Company. \n\nIf you don’t know the exact amount your best guess is fine. \n\n1. Nothing - I have no outstanding credit \n2. Less than £100 \n3. £100 - £499 \n4. £500 - £999 \n5. £1,000 - £4,999 \n6. £5,000 - £9,999 \n7. £10,000 - £19,999 \n8. £20,000 or more \n9. Don’t know \n10. Prefer not to say"},{"$f":"INDEX(Questions!E:K,MATCH(MWDTD!G8,Questions!F:F,0),1)","v":"Y"},23]
[null,{"$f":"INDEX(Questions!E:K,MATCH(MWDTD!G9,Questions!F:F,0),3)","v":"Managing credit use"},{"$f":"INDEX(Questions!E:K,MATCH(MWDTD!G9,Questions!F:F,0),4)","v":0},{"$f":"INDEX(Questions!E:K,MATCH(MWDTD!G9,Questions!F:F,0),5)","v":"Approach to credit card repayment "},{"$f":"INDEX(Questions!E:K,MATCH(MWDTD!G9,Questions!F:F,0),7)","v":"How do you generally handle paying your bill each month for your credit card(s) or store card(s)? 1. Always pay only the minimum 2. Usually pay only the minimum 3. Usually pay something between the minimum and the full balance 4. Usually pay full 5. Always pay full 6. Don’t know 7. Prefer not to say"},{"$f":"INDEX(Questions!E:K,MATCH(MWDTD!G9,Questions!F:F,0),1)","v":"Y"},25]
[null,{"$f":"INDEX(Questions!E:K,MATCH(MWDTD!G10,Questions!F:F,0),3)","v":"Managing credit use"},{"$f":"INDEX(Questions!E:K,MATCH(MWDTD!G10,Questions!F:F,0),4)","v":" "},{"$f":"INDEX(Questions!E:K,MATCH(MWDTD!G10,Questions!F:F,0),5)","v":"Preference for saving up rather than borrowing"},{"$f":"INDEX(Questions!E:K,MATCH(MWDTD!G10,Questions!F:F,0),7)","v":"I am now going to read you some things that other people have said about managing money. Please tell me how strongly you agree or disagree with them.\n - I hate to borrow – I would much rather save up in advance"},{"$f":"INDEX(Questions!E:K,MATCH(MWDTD!G10,Questions!F:F,0),1)","v":"Y"},26]
[null,{"$f":"INDEX(Questions!E:K,MATCH(MWDTD!G11,Questions!F:F,0),3)","v":"Managing credit use"},{"$f":"INDEX(Questions!E:K,MATCH(MWDTD!G11,Questions!F:F,0),4)","v":"Planning how to pay down debt "},{"$f":"INDEX(Questions!E:K,MATCH(MWDTD!G11,Questions!F:F,0),5)","v":"Quality of plan for paying down debt "},{"$f":"INDEX(Questions!E:K,MATCH(MWDTD!G11,Questions!F:F,0),7)","v":"How much of a plan do you have about how you will pay off or reduce my debts?\nPlease answer on a scale of 0 to 10, where 0 means you don’t have a plan of what you need to do and 10 means you have a very specific plan of what you need to do.\n\n- 0 I don’t have a plan of what I need to do\n...\n- 10 I have a very specific plan of what I need to do\n\nDon’t know\n\n"},{"$f":"INDEX(Questions!E:K,MATCH(MWDTD!G11,Questions!F:F,0),1)","v":"Y"},24]
[null,{"$f":"INDEX(Questions!E:K,MATCH(MWDTD!G12,Questions!F:F,0),3)","v":"Managing credit use"},{"$f":"INDEX(Questions!E:K,MATCH(MWDTD!G12,Questions!F:F,0),4)","v":"Taking steps to tackle problem debt"},{"$f":"INDEX(Questions!E:K,MATCH(MWDTD!G12,Questions!F:F,0),5)","v":"Steps taken to tackle problem debt"},{"$f":"INDEX(Questions!E:K,MATCH(MWDTD!G12,Questions!F:F,0),7)","v":"PRE: In the last X months, which of the following steps have you taken to reduce the amount of money you owe? This includes any debts you haven’t paid  or late/unpaid bills and credit commitments.\n\nPOST: Since [Reference Point], which of the following steps have you taken to reduce the amount of money you owe? This includes any debts you haven’t paid  or late/unpaid bills and credit commitments.\n\nCHOOSE ALL THAT APPLY\n\n1. Do not have any debts\n2. Increased regular payments\n3. Paid a lump sum towards them\n4. Spoken to the company/companies the money is owed to\n5. Taken independent advice (e.g. from Citizen's Advice Bureau, StepChange, Money Advice Service)\n6. Consolidated loans or credit cards \n7. Set up a Debt Management Plan or Debt Arrangement Scheme\n8. Arranged to write off some or all debts (e.g. applied for bankruptcy or a debt relief order, or set up an IVA)\n9. Other (specify)\n10. None of these, but have debts\n"},{"$f":"INDEX(Questions!E:K,MATCH(MWDTD!G12,Questions!F:F,0),1)","v":"N"},27]
[null,{"$f":"INDEX(Questions!E:K,MATCH(MWDTD!G13,Questions!F:F,0),3)","v":"Not borrowing for every day spending"},{"$f":"INDEX(Questions!E:K,MATCH(MWDTD!G13,Questions!F:F,0),4)","v":0},{"$f":"INDEX(Questions!E:K,MATCH(MWDTD!G13,Questions!F:F,0),5)","v":"Frequency of borrowing money to pay off debts"},{"$f":"INDEX(Questions!E:K,MATCH(MWDTD!G13,Questions!F:F,0),7)","v":"How often do you/your household borrow money to pay off debts? \n\n1. Very often\n2. Fairly often\n3. Sometimes\n4. Not very often\n5. Never\n6. Don’t know"},{"$f":"INDEX(Questions!E:K,MATCH(MWDTD!G13,Questions!F:F,0),1)","v":"Y"},35]
[null,{"$f":"INDEX(Questions!E:K,MATCH(MWDTD!G14,Questions!F:F,0),3)","v":"Not borrowing for every day spending"},{"$f":"INDEX(Questions!E:K,MATCH(MWDTD!G14,Questions!F:F,0),4)","v":0},{"$f":"INDEX(Questions!E:K,MATCH(MWDTD!G14,Questions!F:F,0),5)","v":"How often borrows from friends and family"},{"$f":"INDEX(Questions!E:K,MATCH(MWDTD!G14,Questions!F:F,0),7)","v":"How often do you/your household borrow from family/friends because you have run out of money?\n\n1. Very often\n2. Fairly often\n3. Sometimes\n4. Not very often\n5. Never\n6. Don’t know"},{"$f":"INDEX(Questions!E:K,MATCH(MWDTD!G14,Questions!F:F,0),1)","v":"Y"},36]
[null,{"$f":"INDEX(Questions!E:K,MATCH(MWDTD!G15,Questions!F:F,0),3)","v":"Not borrowing for every day spending"},{"$f":"INDEX(Questions!E:K,MATCH(MWDTD!G15,Questions!F:F,0),4)","v":0},{"$f":"INDEX(Questions!E:K,MATCH(MWDTD!G15,Questions!F:F,0),5)","v":"Frequency of borrowing money to buy food or to pay expenses"},{"$f":"INDEX(Questions!E:K,MATCH(MWDTD!G15,Questions!F:F,0),7)","v":"How often do you/your household use a credit card, overdraft or borrow money to buy food or pay bills because\nyou’ve run short of money?\n\n1. Very often\n2. Fairly often\n3. Sometimes\n4. Not very often\n5. Never\n6. Don’t know"},{"$f":"INDEX(Questions!E:K,MATCH(MWDTD!G15,Questions!F:F,0),1)","v":"Y"},37]
[null,{"$f":"INDEX(Questions!E:K,MATCH(MWDTD!G16,Questions!F:F,0),3)","v":"Not borrowing for every day spending"},{"$f":"INDEX(Questions!E:K,MATCH(MWDTD!G16,Questions!F:F,0),4)","v":0},{"$f":"INDEX(Questions!E:K,MATCH(MWDTD!G16,Questions!F:F,0),5)","v":"Frequency of being overdrawn on current account"},{"$f":"INDEX(Questions!E:K,MATCH(MWDTD!G16,Questions!F:F,0),7)","v":"How often you are overdrawn on your current account?\n \n1. Very often\n2. Fairly often\n3. Sometimes\n4. Not very often\n5. Never\n6. Don’t know"},{"$f":"INDEX(Questions!E:K,MATCH(MWDTD!G16,Questions!F:F,0),1)","v":"Y"},38]
[null,{"$f":"INDEX(Questions!E:K,MATCH(MWDTD!G17,Questions!F:F,0),3)","v":"Not borrowing for every day spending"},{"$f":"INDEX(Questions!E:K,MATCH(MWDTD!G17,Questions!F:F,0),4)","v":0},{"$f":"INDEX(Questions!E:K,MATCH(MWDTD!G17,Questions!F:F,0),5)","v":"Types of short-term high-cost credit used in the last year"},{"$f":"INDEX(Questions!E:K,MATCH(MWDTD!G17,Questions!F:F,0),7)","v":"In the last year, have you taken out any of the following? \nPLEASE SELECT ALL THAT APPLY \n1. Payday loan - one repayment on payday or at the end of the month (e.g. Wonga, QuickQuid, Express Finance or Payday UK) \n2. Other short-term credit – like a payday loan but repaid in instalments(e.g. Peachy, Cash Genie, Lending Stream) \n3. Pawn broker loan–borrow money against an item you pawn \n4. Other (please specify) \n5. None of these \n6. Don’t know/can’t remember "},{"$f":"INDEX(Questions!E:K,MATCH(MWDTD!G17,Questions!F:F,0),1)","v":"Y"},39]
[null,{"$f":"INDEX(Questions!E:K,MATCH(MWDTD!G18,Questions!F:F,0),3)","v":"Active saving "},{"$f":"INDEX(Questions!E:K,MATCH(MWDTD!G18,Questions!F:F,0),4)","v":"Saving on a regular basis"},{"$f":"INDEX(Questions!E:K,MATCH(MWDTD!G18,Questions!F:F,0),5)","v":"Frequency of saving and amount saved "},{"$f":"INDEX(Questions!E:K,MATCH(MWDTD!G18,Questions!F:F,0),7)","v":"A) Which of these best describes how often you save money? \nCHOOSE ONE ONLY\n\n1. Every month\n2. Most months\n3. Some months, but not others\n4. Rarely/never\n5. Don’t know\n\nB) Just thinking about the months that you save money is the amount that you save…\n\n1. Roughly the same each month\n2. A little different from month to month\n3. Very different from month to month\n4. Don’t know\n\nC) About how much on average do you personally manage to save each month, at the moment? \nENTER AMOUNT IN £\nVaries too much to say"},{"$f":"INDEX(Questions!E:K,MATCH(MWDTD!G18,Questions!F:F,0),1)","v":"Y"},51]
[null,{"$f":"INDEX(Questions!E:K,MATCH(MWDTD!G19,Questions!F:F,0),3)","v":"Keeping track of income and spending"},{"$f":"INDEX(Questions!E:K,MATCH(MWDTD!G19,Questions!F:F,0),4)","v":"Regularly checks current account"},{"$f":"INDEX(Questions!E:K,MATCH(MWDTD!G19,Questions!F:F,0),5)","v":"Frequency of checking current account"},{"$f":"INDEX(Questions!E:K,MATCH(MWDTD!G19,Questions!F:F,0),7)","v":"How often do you normally check how much money is in the current account that you use most often for your daily\noutgoings? e.g. at a cash machine, by text, online banking or mobile banking app. \nPLEASE SELECT ONE ONLY \n\n1. Every day \n2. At least once a week, but not every day \n3. At least once a fortnight, but not once a week \n4. At least once a month, but not once a fortnight \n5. Less than once a month \n6. Never \n7. Don’t know"},{"$f":"INDEX(Questions!E:K,MATCH(MWDTD!G19,Questions!F:F,0),1)","v":"Y"},29]
[null,{"$f":"INDEX(Questions!E:K,MATCH(MWDTD!G20,Questions!F:F,0),3)","v":"Keeping track of income and spending"},{"$f":"INDEX(Questions!E:K,MATCH(MWDTD!G20,Questions!F:F,0),4)","v":"Keeping track of income and spending"},{"$f":"INDEX(Questions!E:K,MATCH(MWDTD!G20,Questions!F:F,0),5)","v":"Methods used to keep track of income and expenditure"},{"$f":"INDEX(Questions!E:K,MATCH(MWDTD!G20,Questions!F:F,0),7)","v":"Which, if any of these ways, do you regularly use to keep track of your income and spending? Please select all that apply. \nPLEASE SELECT ALL THAT APPLY\n\n1. Online budgeting tool \n2. Mobile banking app from your bank \n3. Budgeting or finance app on your phone \n4. Spreadsheet \n5. Piece of paper \n6. Accounts book or notebook \n7. Financial software package \n8. By checking bank balance\n9. By reviewing bank statements \n10. In head (mentally) \n11. Other (please specify) \n12. None of these – I don’t keep track \n13. Don’t know "},{"$f":"INDEX(Questions!E:K,MATCH(MWDTD!G20,Questions!F:F,0),1)","v":"Y"},30]
[null,{"$f":"INDEX(Questions!E:K,MATCH(MWDTD!G21,Questions!F:F,0),3)","v":"Keeping track of income and spending"},{"$f":"INDEX(Questions!E:K,MATCH(MWDTD!G21,Questions!F:F,0),4)","v":" "},{"$f":"INDEX(Questions!E:K,MATCH(MWDTD!G21,Questions!F:F,0),5)","v":"Accuracy of knowledge about spending money"},{"$f":"INDEX(Questions!E:K,MATCH(MWDTD!G21,Questions!F:F,0),7)","v":"Which of these best describes how accurately you know the balance on the current account that you use most often for your daily\noutgoings?\nWe’re not interested in how much money is in the account, just how accurately you\nknow how much money you have in the account. \n\nIF DON’T HAVE CURRENT ACCOUNT\nWhich of these best describes how accurately you know how much money you have at present, excluding any savings?  We’re not interested in how much money you have, just how accurately you know how much money you have to spend. \nCHOOSE ONE ONLY\n\n1. I know within a pound or two\n2. I know within £10 \n3. I know within £50\n4. I know within £100 \n5. I know within £500\n6. I have no idea at all\n\n"},{"$f":"INDEX(Questions!E:K,MATCH(MWDTD!G21,Questions!F:F,0),1)","v":"Y"},28]
[null,{"$f":"INDEX(Questions!E:K,MATCH(MWDTD!G22,Questions!F:F,0),3)","v":"Keeping track of income and spending"},{"$f":"INDEX(Questions!E:K,MATCH(MWDTD!G22,Questions!F:F,0),4)","v":"Creating and sticking to a viable budget"},{"$f":"INDEX(Questions!E:K,MATCH(MWDTD!G22,Questions!F:F,0),5)","v":"Whether keeping track of income"},{"$f":"INDEX(Questions!E:K,MATCH(MWDTD!G22,Questions!F:F,0),7)","v":"How closely do you keep track of your/your household’s income and expenditure?\n\n1. Very closely\n2. Fairly closely\n3. Not very closely\n4. Not at all\n5. Don’t know"},{"$f":"INDEX(Questions!E:K,MATCH(MWDTD!G22,Questions!F:F,0),1)","v":"Y"},32]
[null,{"$f":"INDEX(Questions!E:K,MATCH(MWDTD!G23,Questions!F:F,0),3)","v":"Keeping track of income and spending"},{"$f":"INDEX(Questions!E:K,MATCH(MWDTD!G23,Questions!F:F,0),4)","v":"Creating and sticking to a viable budget"},{"$f":"INDEX(Questions!E:K,MATCH(MWDTD!G23,Questions!F:F,0),5)","v":"Frequency of sticking to budget"},{"$f":"INDEX(Questions!E:K,MATCH(MWDTD!G23,Questions!F:F,0),7)","v":"A) How closely do you normally plan how you will spend your money over the coming week or month? For example by drawing up a budget.\nCHOOSE ONE ONLY\n\n1. Very closely\n2. Fairly closely\n3. Not very closely\n4. I do not plan my spending at all\n5. Don't know\n\nB) And, how often do you keep to the budget you set?\nCHOOSE ONE ONLY\n\n1. Always \n2. Most of the time\n3. Sometimes\n4. Hardly ever\n5. Never\n6. Do not budget"},{"$f":"INDEX(Questions!E:K,MATCH(MWDTD!G23,Questions!F:F,0),1)","v":"N"},31]
[null,{"$f":"INDEX(Questions!E:K,MATCH(MWDTD!G24,Questions!F:F,0),3)","v":"Adjusting spending"},{"$f":"INDEX(Questions!E:K,MATCH(MWDTD!G24,Questions!F:F,0),4)","v":"Plans spending to cover tight months"},{"$f":"INDEX(Questions!E:K,MATCH(MWDTD!G24,Questions!F:F,0),5)","v":"Plans spending to cover tight months"},{"$f":"INDEX(Questions!E:K,MATCH(MWDTD!G24,Questions!F:F,0),7)","v":"To what extent would you say the following statement apply to you personally?\nI plan my spending to cover months where I expect money will be tighter\n\nPlease answer on a scale of 0 to 10, where 0 means it doesn’t sound like you at all and 10 means it sounds a lot like you\n\n1. 0 Does not sound like me at all\n2. 1\n3. 2\n4. 3\n5. 4\n6. 5\n7. 6\n8. 7\n9. 8\n10. 9\n11. 10 Sounds a lot like me\n12. Don’t know\n13. Not applicable"},{"$f":"INDEX(Questions!E:K,MATCH(MWDTD!G24,Questions!F:F,0),1)","v":"Y"},40]
[null,{"$f":"INDEX(Questions!E:K,MATCH(MWDTD!G25,Questions!F:F,0),3)","v":"Adjusting spending"},{"$f":"INDEX(Questions!E:K,MATCH(MWDTD!G25,Questions!F:F,0),4)","v":"Changes spending as a result of keeping track"},{"$f":"INDEX(Questions!E:K,MATCH(MWDTD!G25,Questions!F:F,0),5)","v":"How much changes spending as a result of keeping track"},{"$f":"INDEX(Questions!E:K,MATCH(MWDTD!G25,Questions!F:F,0),7)","v":"How closely do you keep track of your/your household’s income and expenditure?\n1. Very closely\n2. Fairly closely\n3. Not very closely\n4. Not at all\n5. Don’t know\nASK ALL\n\nHow much, if at all, do you change what you spend as a result of this?\n1. Great deal\n2. Fair amount\n3. Not very much\n4. Not at all\n5. Don't know"},{"$f":"INDEX(Questions!E:K,MATCH(MWDTD!G25,Questions!F:F,0),1)","v":"Y"},41]
[null,{"$f":"INDEX(Questions!E:K,MATCH(MWDTD!G26,Questions!F:F,0),3)","v":"Adjusting spending"},{"$f":"INDEX(Questions!E:K,MATCH(MWDTD!G26,Questions!F:F,0),4)","v":"Adjusts spending on non-essentials when life changes"},{"$f":"INDEX(Questions!E:K,MATCH(MWDTD!G26,Questions!F:F,0),5)","v":"Willingness to adjust non-essential spending"},{"$f":"INDEX(Questions!E:K,MATCH(MWDTD!G26,Questions!F:F,0),7)","v":" To what extent would you say the following statement apply to you personally?\nI am prepared to adjust the amount of money I spend on non-essentials if my life changes \n\nPlease answer on a scale of 0 to 10, where 0 means it doesn’t sound like you at all and 10 means it sounds a lot like you\n\n1. 0 Does not sound like me at all\n2. 1\n3. 2\n4. 3\n5. 4\n6. 5\n7. 6\n8. 7\n9. 8\n10. 9\n11. 10 Sounds a lot like me\n12. Don’t know"},{"$f":"INDEX(Questions!E:K,MATCH(MWDTD!G26,Questions!F:F,0),1)","v":"Y"},42]
[null,{"$f":"INDEX(Questions!E:K,MATCH(MWDTD!G27,Questions!F:F,0),3)","v":"Shopping around"},{"$f":"INDEX(Questions!E:K,MATCH(MWDTD!G27,Questions!F:F,0),4)","v":" "},{"$f":"INDEX(Questions!E:K,MATCH(MWDTD!G27,Questions!F:F,0),5)","v":"Regularity of shopping around to get the best deal  "},{"$f":"INDEX(Questions!E:K,MATCH(MWDTD!G27,Questions!F:F,0),7)","v":"How much, if at all, do you shop around for better deals on…\nA - utilities like gas or electricity\nB - your phone, internet or tv packages\nE – car or home insurance\nF – bank or savings accounts\nG - credit cards\n\n1. Not at all\n2. Not very much\n3. Fair amount\n4. Great deal\n5. Don’t Know"},{"$f":"INDEX(Questions!E:K,MATCH(MWDTD!G27,Questions!F:F,0),1)","v":"Y"},48]
[null,{"$f":"INDEX(Questions!E:K,MATCH(MWDTD!G28,Questions!F:F,0),3)","v":"Maximising income "},{"$f":"INDEX(Questions!E:K,MATCH(MWDTD!G28,Questions!F:F,0),4)","v":" "},{"$f":"INDEX(Questions!E:K,MATCH(MWDTD!G28,Questions!F:F,0),5)","v":"Steps taken to make money go further"},{"$f":"INDEX(Questions!E:K,MATCH(MWDTD!G28,Questions!F:F,0),7)","v":"Which of the following things, if any, do you currently do to make your money go further?  \nCHOOSE ALL THAT APPLY\n\n1. Shop around for food and groceries \n2. Look out for special offers or reduced items\n3. Plan meals in advance \n4. Make a shopping list\n5. Avoid treats and non-essential items\n6. Use money saving tips\n7. Turn lights/power off at home when they are not in use \n8. None of these"},{"$f":"INDEX(Questions!E:K,MATCH(MWDTD!G28,Questions!F:F,0),1)","v":"N"},49]
[null,{"$f":"INDEX(Questions!E:K,MATCH(MWDTD!G29,Questions!F:F,0),3)","v":"Maximising income "},{"$f":"INDEX(Questions!E:K,MATCH(MWDTD!G29,Questions!F:F,0),4)","v":" "},{"$f":"INDEX(Questions!E:K,MATCH(MWDTD!G29,Questions!F:F,0),5)","v":"Claiming benefits and adjusting claim following changes in circumstances"},{"$f":"INDEX(Questions!E:K,MATCH(MWDTD!G29,Questions!F:F,0),7)","v":"We have not included a measure of ths behaviour as the actions an individual should take, and when, will differ depending on the their circumstances, the benefits they are claiming and changes to welfare policy.\n\nHouseholds who are claiming benefits must ensure their claim is accurate and up to date following any changes in circumstances, both to ensure that they are getting the full amount they are entitled to and to stop any over-payments, which they might struggle to pay back in the future. \n\nIf your intervention is seeking to maximise beneficiaries' income by supporting them to claim benefits, you might consider using changes to beneficiaries income alongside other administration data (such as whether the advisor helped them to make a claim) to evidence this. Please get in touch with the Money Advice Service if you would like help with deciding how best to measure this outcome."},{"$f":"INDEX(Questions!E:K,MATCH(MWDTD!G29,Questions!F:F,0),1)","v":"N"},50]
[null,{"$f":"INDEX(Questions!E:K,MATCH(MWDTD!G30,Questions!F:F,0),3)","v":"Managing bill payments"},{"$f":"INDEX(Questions!E:K,MATCH(MWDTD!G30,Questions!F:F,0),4)","v":" "},{"$f":"INDEX(Questions!E:K,MATCH(MWDTD!G30,Questions!F:F,0),5)","v":"Frequency of missed bill payments "},{"$f":"INDEX(Questions!E:K,MATCH(MWDTD!G30,Questions!F:F,0),7)","v":"How often do you delay or miss paying a bill, beyond the date it becomes due?\nCHOOSE ONE ONLY\n\n1. I often do this \n2. I occasionally do this \n3. I rarely do this \n4. I never do this"},{"$f":"INDEX(Questions!E:K,MATCH(MWDTD!G30,Questions!F:F,0),1)","v":"N"},33]
[null,{"$f":"INDEX(Questions!E:K,MATCH(MWDTD!G31,Questions!F:F,0),3)","v":"Managing bill payments"},{"$f":"INDEX(Questions!E:K,MATCH(MWDTD!G31,Questions!F:F,0),4)","v":" "},{"$f":"INDEX(Questions!E:K,MATCH(MWDTD!G31,Questions!F:F,0),5)","v":"Quality of planning to pay bills"},{"$f":"INDEX(Questions!E:K,MATCH(MWDTD!G31,Questions!F:F,0),7)","v":"How well do you usually plan ahead to make sure you have the money to pay for regular bills and expenses? \nCHOOSE ONE ONLY\n\n1. Plan ahead to cover the full amount\n2. Plan ahead to cover some of the amount\n3. Don't plan ahead because there is always enough money to cover them\n4. Don't plan ahead at all\n"},{"$f":"INDEX(Questions!E:K,MATCH(MWDTD!G31,Questions!F:F,0),1)","v":"N "},34]

{"sheet":"PAFLE","index":12,"n_rows":17,"n_cols":7,"rows_kept":17,"cut":false,"hidden":false,"merged":[[6,6,6,7]]}
[]
[null,null,"Adult Outcome Frameworks"]
[]
[null,"Behaviours - Planning Ahead For Life Events"]
[null,"Select the questions that are relevant to your intervention -  use the first question for each indicator, "]
[null,"only use additional questions if that indicator is particularly important."]
[null,"Higher level outcome","Lower level outcome","Indicator","Question","Building Block Y/N","Question"]
[null,{"$f":"INDEX(Questions!E:K,MATCH(PAFLE!G8,Questions!F:F,0),3)","v":"Working towards financial goals "},{"$f":"INDEX(Questions!E:K,MATCH(PAFLE!G8,Questions!F:F,0),4)","v":0},{"$f":"INDEX(Questions!E:K,MATCH(PAFLE!G8,Questions!F:F,0),5)","v":"How much thought about financial goals generally"},{"$f":"INDEX(Questions!E:K,MATCH(PAFLE!G8,Questions!F:F,0),7)","v":"PRE. Before today, how much have you thought about financial goals for the next five years?\n\n1. Great deal\n2. Fair amount\n3. Not very much\n4. Not at all\n5. Don’t know\n\nPOST. Since [REFERENCE POINT] how much have you thought about financial goals for the next five years?\n\n1. Great deal\n2. Fair amount\n3. Not very much\n4. Not at all\n5. Don’t know"},{"$f":"INDEX(Questions!E:K,MATCH(PAFLE!G8,Questions!F:F,0),1)","v":"Y"},55]
[null,{"$f":"INDEX(Questions!E:K,MATCH(PAFLE!G9,Questions!F:F,0),3)","v":"Working towards financial goals "},{"$f":"INDEX(Questions!E:K,MATCH(PAFLE!G9,Questions!F:F,0),4)","v":0},{"$f":"INDEX(Questions!E:K,MATCH(PAFLE!G9,Questions!F:F,0),5)","v":"How much of a plan for financial goals generally"},{"$f":"INDEX(Questions!E:K,MATCH(PAFLE!G9,Questions!F:F,0),7)","v":"Thinking more generally about financial goals you might have for the next five years, how much of a plan do you have for Financial goals for the next five years \n\n1. Clear plan \n2. Rough plan \n3. Not much of a plan \n4. No plan at all \n5. I do not have any financial goals for the next five years \n6. Don’t know"},{"$f":"INDEX(Questions!E:K,MATCH(PAFLE!G9,Questions!F:F,0),1)","v":"Y"},56]
[null,{"$f":"INDEX(Questions!E:K,MATCH(PAFLE!G10,Questions!F:F,0),3)","v":"Working towards financial goals "},{"$f":"INDEX(Questions!E:K,MATCH(PAFLE!G10,Questions!F:F,0),4)","v":"Planning to acheive specific financial goals"},{"$f":"INDEX(Questions!E:K,MATCH(PAFLE!G10,Questions!F:F,0),5)","v":"Count of goals and level of plan "},{"$f":"INDEX(Questions!E:K,MATCH(PAFLE!G10,Questions!F:F,0),7)","v":"A) Which, if any, of these financial goals do you have for the next five years?\nPLEASE SELECT ALL THAT APPLY \n\n1. Just making ends meet day to day\n2. Paying off my debts/reducing debts\n3. Saving money to rent own home\n4. Saving money to buy own home\n5. Saving money for a wedding\n6. Saving money to start a family/have another child\n7. Saving money  for education for me <IF CODE 2 AT A6 and my partner/spouse>\n8. Saving money  for education for children/grown-up children\n9. Saving money  to help grown-up children to rent a home\n10. Saving money  to help grown-up children to buy a home\n11. Saving money for a holiday\n12. Saving money for retirement\n13. Saving money for home improvements\n14. Saving money to purchase a car/van/motorbike\n15. Saving money generally\n16. Other (please specify)\n17. None of these \n\nB) How much of a plan do you have about how you will achieve these goals\nPlease answer on a scale of 0 to 10, where 0 means you don’t have a plan of what you need to do and 10 means you have a very specific plan of what you need to do…\n\n0 I don’t have a plan of what I need to do, I just know I want to do it\n2. 1\n3. 2\n4. 3\n5. 4\n6. 5\n7. 6\n8. 7\n9. 8\n10. 9\n11. 10 I have a very specific plan of what I need to do\n12. Don’t know"},{"$f":"INDEX(Questions!E:K,MATCH(PAFLE!G10,Questions!F:F,0),1)","v":"Y"},54]
[null,{"$f":"INDEX(Questions!E:K,MATCH(PAFLE!G11,Questions!F:F,0),3)","v":"Building resilience"},{"$f":"INDEX(Questions!E:K,MATCH(PAFLE!G11,Questions!F:F,0),4)","v":"Saving for expected and unexpected expenses"},{"$f":"INDEX(Questions!E:K,MATCH(PAFLE!G11,Questions!F:F,0),5)","v":"Number of expected and unexpected expenses "},{"$f":"INDEX(Questions!E:K,MATCH(PAFLE!G11,Questions!F:F,0),7)","v":"Here is a list of some of the reasons people have said they save. Which, if any, of these are reasons why  you/you and your partner/spouse have savings?  \nPLEASE SELECT ALL THAT APPLY\n\n1. To pay for planned expenses, purchases or events\n2. In case I have to pay for unexpected expenses/purchases\n3. For a rainy day generally\n4. In case my or my partner/spouse's income changes\n5. For my retirement (excluding paying into a pension)\n6. None of these (SINGLE CODE ONLY)\n7. Don’t know (SINGLE CODE ONLY)\n\nWhat planned expenses, purchases or events are you saving for?\nPLEASE SELECT ALL THAT APPLY\n\n1. Deposit to rent own home\n2. Deposit to buy own home\n3. Other expenses to move house\n4. A wedding\n5. Starting a family/having another child\n6. Education for me or my partner/spouse\n7. Education for children/grown-up children\n8. Helping grown-up children to rent a home\n9. Helping grown-up children to buy a home\n10. A holiday\n11. Retirement\n12. Home improvements\n13. Purchasing a car/van/motorbike\n14. Other (please specify)\n15. Don’t know (SINGLE CODE ONLY)"},{"$f":"INDEX(Questions!E:K,MATCH(PAFLE!G11,Questions!F:F,0),1)","v":"Y"},52]
[null,{"$f":"INDEX(Questions!E:K,MATCH(PAFLE!G12,Questions!F:F,0),3)","v":"Building resilience "},{"$f":"INDEX(Questions!E:K,MATCH(PAFLE!G12,Questions!F:F,0),4)","v":"Increasing the total amount saved"},{"$f":"INDEX(Questions!E:K,MATCH(PAFLE!G12,Questions!F:F,0),5)","v":"Amount in personal savings and investments (excluding pension)"},{"$f":"INDEX(Questions!E:K,MATCH(PAFLE!G12,Questions!F:F,0),7)","v":"A) Approximately how much, if anything, do you personally have in savings and investments? Please do not include any money that you have saved in a pension. \n\n1. ENTER EXACT AMOUNT\n2. I do not have any savings and investments\n3. Don’t know \n4. Prefer not to say \n\nB) Could you estimate the total within the following bands?\nCHOOSE ONE ONLY\n\n1. £100 or less\n2. £101 - £500\n3. £501 - £1,000\n4. £1,001 - £9,999\n5. £10,000 - £19,999\n6. £20,000 or more\n7. Don’t know\n8. Prefer not to say "},{"$f":"INDEX(Questions!E:K,MATCH(PAFLE!G12,Questions!F:F,0),1)","v":"Y"},53]
[null,{"$f":"INDEX(Questions!E:K,MATCH(PAFLE!G13,Questions!F:F,0),3)","v":"Planning for retirement"},{"$f":"INDEX(Questions!E:K,MATCH(PAFLE!G13,Questions!F:F,0),4)","v":0},{"$f":"INDEX(Questions!E:K,MATCH(PAFLE!G13,Questions!F:F,0),5)","v":"How much done to plan for finances in retirement"},{"$f":"INDEX(Questions!E:K,MATCH(PAFLE!G13,Questions!F:F,0),7)","v":"How much have you done to plan your finances for retirement\n\n1. Great deal\n2. Fair amount\n3. Not very much\n4. Nothing at all\n5. Don’t know"},{"$f":"INDEX(Questions!E:K,MATCH(PAFLE!G13,Questions!F:F,0),1)","v":"Y"},59]
[null,{"$f":"INDEX(Questions!E:K,MATCH(PAFLE!G14,Questions!F:F,0),3)","v":"Planning for retirement"},{"$f":"INDEX(Questions!E:K,MATCH(PAFLE!G14,Questions!F:F,0),4)","v":0},{"$f":"INDEX(Questions!E:K,MATCH(PAFLE!G14,Questions!F:F,0),5)","v":"How much of a plan for finances in retirement"},{"$f":"INDEX(Questions!E:K,MATCH(PAFLE!G14,Questions!F:F,0),7)","v":"How much of a plan do you have for your finances in retirement \n\n1. Clear plan \n2. Rough plan \n3. Not much of a plan \n4. No plan at all \n5. Don’t know"},{"$f":"INDEX(Questions!E:K,MATCH(PAFLE!G14,Questions!F:F,0),1)","v":"Y"},60]
[null,{"$f":"INDEX(Questions!E:K,MATCH(PAFLE!G15,Questions!F:F,0),3)","v":"Planning for retirement"},{"$f":"INDEX(Questions!E:K,MATCH(PAFLE!G15,Questions!F:F,0),4)","v":0},{"$f":"INDEX(Questions!E:K,MATCH(PAFLE!G15,Questions!F:F,0),5)","v":"Actions taken to monitor/improve pension provision"},{"$f":"INDEX(Questions!E:K,MATCH(PAFLE!G15,Questions!F:F,0),7)","v":"PRE. Over the last 12 months have you done any of these? \n\n1. Logged into an online pension account to look at my pension \n2. Read key details of an annual statement or information sent by pension provider \n3. Contacted pension provider \n4. Spoken to a regulated financial adviser (IFA) about retirement planning \n5. Contacted PensionWise or The Pensions Advisory Service (TPAS) \n6. Other – please specify \n7. None of these \n8. Don’t know\n\nPOST. Since [REFERENCE POINT] have you done any of these?\n\n1. Logged into an online pension account to look at my pension \n2. Read key details of an annual statement or information sent by pension provider \n3. Contacted pension provider \n4. Spoken to a regulated financial adviser (IFA) about retirement planning \n5. Contacted PensionWise or The Pensions Advisory Service (TPAS) \n6. Other – please specify \n7. None of these \n8. Don’t know"},{"$f":"INDEX(Questions!E:K,MATCH(PAFLE!G15,Questions!F:F,0),1)","v":"Y"},61]
[null,{"$f":"INDEX(Questions!E:K,MATCH(PAFLE!G16,Questions!F:F,0),3)","v":"Planning for retirement"},{"$f":"INDEX(Questions!E:K,MATCH(PAFLE!G16,Questions!F:F,0),4)","v":0},{"$f":"INDEX(Questions!E:K,MATCH(PAFLE!G16,Questions!F:F,0),5)","v":"Whether currently paying into a pension scheme "},{"$f":"INDEX(Questions!E:K,MATCH(PAFLE!G16,Questions!F:F,0),7)","v":"Are you currently paying into one or more pensions? This can include an employer or any other type of private pension\nCHOOSE ONE ONLY\n\n1. Yes\n2. No\n3. I am retired so I am not paying into a pension\n4. Don’t know"},{"$f":"INDEX(Questions!E:K,MATCH(PAFLE!G16,Questions!F:F,0),1)","v":"N"},57]
[null,{"$f":"INDEX(Questions!E:K,MATCH(PAFLE!G17,Questions!F:F,0),3)","v":"Planning for retirement"},{"$f":"INDEX(Questions!E:K,MATCH(PAFLE!G17,Questions!F:F,0),4)","v":0},{"$f":"INDEX(Questions!E:K,MATCH(PAFLE!G17,Questions!F:F,0),5)","v":"Steps taken to ensure adequate income (for pension or retirement)"},{"$f":"INDEX(Questions!E:K,MATCH(PAFLE!G17,Questions!F:F,0),7)","v":"PRE. In the last [X] months, which of the following have you done in relation to your pension or retirement income?\n\nPOST. Since [REFERENCE POINT], which of the following have you done in relation to your pension or retirement income? \nCHOOSE ALL THAT APPLY\n\n1. Checked whether my income will be enough to meet my needs in retirement\n2. Increased how much I am paying towards my retirement income\n3. I don't have a pension / source of retirement income\n4. Neither of these\n"},{"$f":"INDEX(Questions!E:K,MATCH(PAFLE!G17,Questions!F:F,0),1)","v":"N"},58]

{"sheet":"PSA","index":13,"n_rows":9,"n_cols":7,"rows_kept":9,"cut":false,"hidden":false,"merged":[[6,6,6,7]]}
[]
[null,null,"Adult Outcome Frameworks"]
[]
[null,"Behaviours - Proactively Seeking Advice"]
[null,"Select the questions that are relevant to your intervention -  use the first question for each indicator, "]
[null,"only use additional questions if that indicator is particularly important."]
[null,"Higher level outcome","Lower level outcome","Indicator","Question","Building Block Y/N","Question"]
[null,{"$f":"INDEX(Questions!E:K,MATCH(PSA!G8,Questions!F:F,0),3)","v":"Proactively seeking advice and guidance "},{"$f":"INDEX(Questions!E:K,MATCH(PSA!G8,Questions!F:F,0),4)","v":" "},{"$f":"INDEX(Questions!E:K,MATCH(PSA!G8,Questions!F:F,0),5)","v":"How recently guidance and advice has been used"},{"$f":"INDEX(Questions!E:K,MATCH(PSA!G8,Questions!F:F,0),7)","v":"PRE: In the last [SIX] months, which of these have you used for information or advice about your finances?\nPOST: Since [REFERENCE POINT] which of these have you used for information or advice about your finances?\nCHOOSE ALL THAT APPLY\n1. A free advice agency (Money Advice Service, Citizens Advice Bureau, money or debt advice centre, law centre, consumer credit counselling service, National Debtline, benefits office)\n2. An insolvency practitioner\n3. Accountant, bank or other financial adviser\n4. Solicitor or lawyer\n5. Other advice company or person charging a fee\n6. Landlord\n7. Family or friends\n8. Martin Lewis/Money Saving Expert\n9. Price comparison websites e.g. moneysupermarket.com\n10. Other websites\n11. Other (specify)\n12. I haven’t used any of these for advice\n"},{"$f":"INDEX(Questions!E:K,MATCH(PSA!G8,Questions!F:F,0),1)","v":"N"},62]
[null,{"$f":"INDEX(Questions!E:K,MATCH(PSA!G9,Questions!F:F,0),3)","v":"Proactively seeking online advice and guidance"},{"$f":"INDEX(Questions!E:K,MATCH(PSA!G9,Questions!F:F,0),4)","v":" "},{"$f":"INDEX(Questions!E:K,MATCH(PSA!G9,Questions!F:F,0),5)","v":"How frequently online advice and guidance has been sought"},{"$f":"INDEX(Questions!E:K,MATCH(PSA!G9,Questions!F:F,0),7)","v":"How often in the last [THREE MONTHS] have you gone online for the following purposes?\n\n- For information or advice on a financial product you needed or wanted\n- To find out whether a financial product was suitable for you\n- To compare financial products to find the best deal for you\n\nCHOOSE ONE FOR EACH\n1. Every day\n2. Every week\n3. Every few weeks\n4. Never \n5. Don’t know"},{"$f":"INDEX(Questions!E:K,MATCH(PSA!G9,Questions!F:F,0),1)","v":"N "},63]

{"sheet":"FC","index":14,"n_rows":15,"n_cols":7,"rows_kept":15,"cut":false,"hidden":false,"merged":[[6,6,6,7]]}
[]
[null,null,"Adult Outcome Frameworks"]
[]
[null,"Mindset - Financial Confidence"]
[null,"Select the questions that are relevant to your intervention -  use the first question for each indicator, "]
[null,"only use additional questions if that indicator is particularly important."]
[null,"Higher level outcome","Lower level outcome","Indicator","Question","Building Block Y/N","Question"]
[null,{"$f":"INDEX(Questions!E:K,MATCH(FC!G8,Questions!F:F,0),3)","v":"Financial confidence"},{"$f":"INDEX(Questions!E:K,MATCH(FC!G8,Questions!F:F,0),4)","v":"Confident managing money"},{"$f":"INDEX(Questions!E:K,MATCH(FC!G8,Questions!F:F,0),5)","v":"Level of confidence in managing money"},{"$f":"INDEX(Questions!E:K,MATCH(FC!G8,Questions!F:F,0),7)","v":"How confident do you feel about managing your money?  \n\nPlease answer on a scale of 0 to 10, where 0 is ‘not at all confident and 10 is ‘very confident\n 0…10 scale\nDon't know\n"},{"$f":"INDEX(Questions!E:K,MATCH(FC!G8,Questions!F:F,0),1)","v":"Y"},86]
[null,{"$f":"INDEX(Questions!E:K,MATCH(FC!G9,Questions!F:F,0),3)","v":"Financial confidence"},{"$f":"INDEX(Questions!E:K,MATCH(FC!G9,Questions!F:F,0),4)","v":"Confident making decisions about products/services"},{"$f":"INDEX(Questions!E:K,MATCH(FC!G9,Questions!F:F,0),5)","v":"Level of confidence making decisions about products/services"},{"$f":"INDEX(Questions!E:K,MATCH(FC!G9,Questions!F:F,0),7)","v":"How confident do you feel making decisions about financial products and services?  \n\nPlease answer on a scale of 0 to 10, where 0 is ‘not at all confident and 10 is ‘very confident\n 0…10 scale\nDon't know\n"},{"$f":"INDEX(Questions!E:K,MATCH(FC!G9,Questions!F:F,0),1)","v":"Y"},87]
[null,{"$f":"INDEX(Questions!E:K,MATCH(FC!G10,Questions!F:F,0),3)","v":"Financial confidence"},{"$f":"INDEX(Questions!E:K,MATCH(FC!G10,Questions!F:F,0),4)","v":"How confident working with numbers in everyday life"},{"$f":"INDEX(Questions!E:K,MATCH(FC!G10,Questions!F:F,0),5)","v":0},{"$f":"INDEX(Questions!E:K,MATCH(FC!G10,Questions!F:F,0),7)","v":"How confident do you feel working with numbers when you need to in everyday life?\nPlease answer on a scale of 0 to 10, where 0 is ‘not at all confident and 10 is ‘very\nconfident\n\n1. 0 Not at all confident\n2. 1\n3. 2\n4. 3\n5. 4\n6. 5\n7. 6\n8. 7\n9. 8\n10. 9\n11. 10 Very confident\n12. Don’t know"},{"$f":"INDEX(Questions!E:K,MATCH(FC!G10,Questions!F:F,0),1)","v":"Y"},88]
[null,{"$f":"INDEX(Questions!E:K,MATCH(FC!G11,Questions!F:F,0),3)","v":"Financial confidence"},{"$f":"INDEX(Questions!E:K,MATCH(FC!G11,Questions!F:F,0),4)","v":"Confident keeping track of income and expenditure"},{"$f":"INDEX(Questions!E:K,MATCH(FC!G11,Questions!F:F,0),5)","v":"Perceived quality of approach to keeping track of income and expenditure"},{"$f":"INDEX(Questions!E:K,MATCH(FC!G11,Questions!F:F,0),7)","v":"Thinking overall about your (and your partner/spouse’s) approach to keeping track of income and expenditure, how well do you think this approach works?\n\nPlease answer on a scale of 0 to 10, where 0 means not at all well and 10 means very well\n\n0…10 scale\nDon't know"},{"$f":"INDEX(Questions!E:K,MATCH(FC!G11,Questions!F:F,0),1)","v":"N"},89]
[null,{"$f":"INDEX(Questions!E:K,MATCH(FC!G12,Questions!F:F,0),3)","v":"Financial confidence"},{"$f":"INDEX(Questions!E:K,MATCH(FC!G12,Questions!F:F,0),4)","v":"Confident exercising their own judgment in financial decisions and to question\nsuggestions and advice"},{"$f":"INDEX(Questions!E:K,MATCH(FC!G12,Questions!F:F,0),5)","v":"Level of confidence dealing with companies and making purchases "},{"$f":"INDEX(Questions!E:K,MATCH(FC!G12,Questions!F:F,0),7)","v":"How much do you agree or disagree with the following statement?  \n \n- When dealing with companies or making purchases, I would consider myself to be a confident and savvy customer\n \n\n1. Strongly agree\n2. Tend to agree\n3. Neither agree nor disagree\n4. Tend to disagree\n5. Strongly disagree\n6. Don’t know\n"},{"$f":"INDEX(Questions!E:K,MATCH(FC!G12,Questions!F:F,0),1)","v":"N"},90]
[null,{"$f":"INDEX(Questions!E:K,MATCH(FC!G13,Questions!F:F,0),3)","v":"Financial confidence"},{"$f":"INDEX(Questions!E:K,MATCH(FC!G13,Questions!F:F,0),4)","v":"Confident exercising their own judgment in financial decisions and to question\nsuggestions and advice"},{"$f":"INDEX(Questions!E:K,MATCH(FC!G13,Questions!F:F,0),5)","v":"Level of confidence making decisions about pensions"},{"$f":"INDEX(Questions!E:K,MATCH(FC!G13,Questions!F:F,0),7)","v":"How much do you agree or disagree with each of the following statements?  \n \n - I know enough about pensions to decide with confidence  how to save for my retirement \n - Sometimes pensions seem so complicated that I cannot really understand the best thing to do \n - Dealing with pensions scares me \n\n1. Strongly agree\n2. Tend to agree\n3. Neither agree nor disagree\n4. Tend to disagree\n5. Strongly disagree\n6. Don’t know"},{"$f":"INDEX(Questions!E:K,MATCH(FC!G13,Questions!F:F,0),1)","v":"N"},91]
[null,{"$f":"INDEX(Questions!E:K,MATCH(FC!G14,Questions!F:F,0),3)","v":"Financial confidence"},{"$f":"INDEX(Questions!E:K,MATCH(FC!G14,Questions!F:F,0),4)","v":"Confident communicating about their situation and needs with financial\nservices professionals."},{"$f":"INDEX(Questions!E:K,MATCH(FC!G14,Questions!F:F,0),5)","v":"Level of confidence talking to advice providers "},{"$f":"INDEX(Questions!E:K,MATCH(FC!G14,Questions!F:F,0),7)","v":"How confident would you feel talking to people who can give you advice about money\n\n1.Very confident \n2. Fairly confident \n3. Not very confident \n4. Not at all confident\n5. Don't know\n"},{"$f":"INDEX(Questions!E:K,MATCH(FC!G14,Questions!F:F,0),1)","v":"N"},92]
[null,{"$f":"INDEX(Questions!E:K,MATCH(FC!G15,Questions!F:F,0),3)","v":"Financial confidence"},{"$f":"INDEX(Questions!E:K,MATCH(FC!G15,Questions!F:F,0),4)","v":" "},{"$f":"INDEX(Questions!E:K,MATCH(FC!G15,Questions!F:F,0),5)","v":"Extent of feeling in control of financial situation\n"},{"$f":"INDEX(Questions!E:K,MATCH(FC!G15,Questions!F:F,0),7)","v":"How much do you agree or disagree with each of the following statements?  \n \n - I feel in control of my finances\n\n1. Strongly agree\n2. Tend to agree\n3. Neither agree nor disagree\n4. Tend to disagree\n5. Strongly disagree\n6. Don’t know\n \n"},{"$f":"INDEX(Questions!E:K,MATCH(FC!G15,Questions!F:F,0),1)","v":"N"},93]

{"sheet":"SO","index":15,"n_rows":12,"n_cols":7,"rows_kept":12,"cut":false,"hidden":false,"merged":[[6,6,6,7]]}
[]
[null,null,"Adult Outcome Frameworks"]
[]
[null,"Mindset - Savings Orientation"]
[null,"Select the questions that are relevant to your intervention -  use the first question for each indicator, "]
[null,"only use additional questions if that indicator is particularly important."]
[null,"Higher level outcome","Lower level outcome","Indicator","Question","Building Block Y/N","Question"]
[null,{"$f":"INDEX(Questions!E:K,MATCH(SO!G8,Questions!F:F,0),3)","v":"Saving orientation"},{"$f":"INDEX(Questions!E:K,MATCH(SO!G8,Questions!F:F,0),4)","v":"Recognise the importance of saving for an unexpected event "},{"$f":"INDEX(Questions!E:K,MATCH(SO!G8,Questions!F:F,0),5)","v":"Perceived importance of saving for a rainy day"},{"$f":"INDEX(Questions!E:K,MATCH(SO!G8,Questions!F:F,0),7)","v":"Thinking overall about your finances, how important do you think it is to save for a rainy day \n\n1. Very important\n2. Fairly important\n3. Neither important nor unimportant\n4. Fairly unimportant\n5. Very unimportant\n6. Don’t know"},{"$f":"INDEX(Questions!E:K,MATCH(SO!G8,Questions!F:F,0),1)","v":"Y"},81]
[null,{"$f":"INDEX(Questions!E:K,MATCH(SO!G9,Questions!F:F,0),3)","v":"Saving orientation"},{"$f":"INDEX(Questions!E:K,MATCH(SO!G9,Questions!F:F,0),4)","v":"Recognise the importance of future financial needs in retirement"},{"$f":"INDEX(Questions!E:K,MATCH(SO!G9,Questions!F:F,0),5)","v":"Perceived importance of putting money aside for retirement"},{"$f":"INDEX(Questions!E:K,MATCH(SO!G9,Questions!F:F,0),7)","v":"How important do you think it is to put money aside for your retirement\n\n1. Very important\n2. Fairly important\n3. Neither important nor unimportant\n4. Fairly unimportant\n5. Very unimportant\n6. Don’t know"},{"$f":"INDEX(Questions!E:K,MATCH(SO!G9,Questions!F:F,0),1)","v":"Y"},82]
[null,{"$f":"INDEX(Questions!E:K,MATCH(SO!G10,Questions!F:F,0),3)","v":"Saving orientation"},{"$f":"INDEX(Questions!E:K,MATCH(SO!G10,Questions!F:F,0),4)","v":"Motivated to keep track of finances "},{"$f":"INDEX(Questions!E:K,MATCH(SO!G10,Questions!F:F,0),5)","v":"Perceived importance of keeping track of income and expenditure "},{"$f":"INDEX(Questions!E:K,MATCH(SO!G10,Questions!F:F,0),7)","v":"How important do you think it is to keep track of your household’s income and expenditure \n\n1. Very important\n2. Fairly important\n3. Neither important nor unimportant\n4. Fairly unimportant\n5. Very unimportant\n6. Don’t know\n"},{"$f":"INDEX(Questions!E:K,MATCH(SO!G10,Questions!F:F,0),1)","v":"Y"},83]
[null,{"$f":"INDEX(Questions!E:K,MATCH(SO!G11,Questions!F:F,0),3)","v":"Saving orientation"},{"$f":"INDEX(Questions!E:K,MATCH(SO!G11,Questions!F:F,0),4)","v":"Understand the value of making their money go further by shopping around"},{"$f":"INDEX(Questions!E:K,MATCH(SO!G11,Questions!F:F,0),5)","v":"Perceived importance of shopping around"},{"$f":"INDEX(Questions!E:K,MATCH(SO!G11,Questions!F:F,0),7)","v":"How important do you think it is to shop around in order to make your money go further \n\n1. Very important\n2. Fairly important\n3. Neither important nor unimportant\n4. Fairly unimportant\n5. Very unimportant\n6. Don’t know"},{"$f":"INDEX(Questions!E:K,MATCH(SO!G11,Questions!F:F,0),1)","v":"Y"},84]
[null,{"$f":"INDEX(Questions!E:K,MATCH(SO!G12,Questions!F:F,0),3)","v":"Saving orientation"},{"$f":"INDEX(Questions!E:K,MATCH(SO!G12,Questions!F:F,0),4)","v":"Understand the value of making their money go further by shopping around"},{"$f":"INDEX(Questions!E:K,MATCH(SO!G12,Questions!F:F,0),5)","v":"Attitude to switching suppliers "},{"$f":"INDEX(Questions!E:K,MATCH(SO!G12,Questions!F:F,0),7)","v":"How much do you agree or disagree with each of the following statements?:\n- I prefer to stick with one company over time rather than keep changing suppliers*\n- There's no point switching things like insurance, energy or bank accounts, it's not worth the hassle\n\n1. Strongly agree\n2. Tend to agree\n3. Neither agree nor disagree\n4. Tend to disagree\n5. Strongly disagree\n6. Don’t know\n"},{"$f":"INDEX(Questions!E:K,MATCH(SO!G12,Questions!F:F,0),1)","v":"N"},85]

{"sheet":"DE","index":16,"n_rows":11,"n_cols":7,"rows_kept":11,"cut":false,"hidden":false,"merged":[[6,6,6,7]]}
[]
[null,null,"Adult Outcome Frameworks"]
[]
[null,"Mindset - Digital Engagement"]
[null,"Select the questions that are relevant to your intervention -  use the first question for each indicator, "]
[null,"only use additional questions if that indicator is particularly important."]
[null,"Higher level outcome","Lower level outcome","Indicator","Question","Building Block Y/N","Question"]
[null,{"$f":"INDEX(Questions!E:K,MATCH(DE!G8,Questions!F:F,0),3)","v":"Digital engagement"},{"$f":"INDEX(Questions!E:K,MATCH(DE!G8,Questions!F:F,0),4)","v":"Digital access to financial products and services "},{"$f":"INDEX(Questions!E:K,MATCH(DE!G8,Questions!F:F,0),5)","v":"Willingness to use the internet to carry out day to day banking"},{"$f":"INDEX(Questions!E:K,MATCH(DE!G8,Questions!F:F,0),7)","v":"To what extent do you agree or disagree with the following statement: I would be happy to use the Internet to carry out day to day banking transactions\n\n1. Strongly agree\n2. Tend to agree\n3. Neither agree nor disagree\n4. Tend to disagree\n5. Strongly disagree\n6. Don’t know"},{"$f":"INDEX(Questions!E:K,MATCH(DE!G8,Questions!F:F,0),1)","v":"Y"},68]
[null,{"$f":"INDEX(Questions!E:K,MATCH(DE!G9,Questions!F:F,0),3)","v":"Digital engagement"},{"$f":"INDEX(Questions!E:K,MATCH(DE!G9,Questions!F:F,0),4)","v":0},{"$f":"INDEX(Questions!E:K,MATCH(DE!G9,Questions!F:F,0),5)","v":"Breadth of internet use "},{"$f":"INDEX(Questions!E:K,MATCH(DE!G9,Questions!F:F,0),7)","v":"Which, if any, of these do you ever use the internet for - using any type of device including a laptop or desktop computer, a mobile phone or a tablet?  \n\n1. Online shopping (purchasing goods/ services / tickets etc.) or online trading/ auctions (e.g. eBay) \n2. Online/mobile banking \n3. Finding/ downloading information for work/ business/ school/ college/ university \n4. Accessing news \n5. Using social networking (such as Facebook, Twitter, Instagram, Snapchat, LinkedIn) \n6. None of these"},{"$f":"INDEX(Questions!E:K,MATCH(DE!G9,Questions!F:F,0),1)","v":"Y"},69]
[null,{"$f":"INDEX(Questions!E:K,MATCH(DE!G10,Questions!F:F,0),3)","v":"Digital engagement"},{"$f":"INDEX(Questions!E:K,MATCH(DE!G10,Questions!F:F,0),4)","v":0},{"$f":"INDEX(Questions!E:K,MATCH(DE!G10,Questions!F:F,0),5)","v":"Hours spent using Internet in last week"},{"$f":"INDEX(Questions!E:K,MATCH(DE!G10,Questions!F:F,0),7)","v":"Approximately how many hours in total have you spent actively using the Internet or doing things online in the last seven days? e.g. E-mail, web browsing/surfing and other on-line services such as downloading, streaming and online gaming. \nPlease don’t include time when you were connected but not using it. Please include both work and personal use. \n\n1. None – not used in the last week \n2. Less than 1 hour \n3. 1 – 3 hours \n4. 4 – 6 hours \n5. 7 – 10 hours \n6. 11 – 19 hours \n7. 20 – 29 hours \n8. 30 hours or more \n9. Don’t know"},{"$f":"INDEX(Questions!E:K,MATCH(DE!G10,Questions!F:F,0),1)","v":"Y"},70]
[null,{"$f":"INDEX(Questions!E:K,MATCH(DE!G11,Questions!F:F,0),3)","v":"Digital engagement"},{"$f":"INDEX(Questions!E:K,MATCH(DE!G11,Questions!F:F,0),4)","v":0},{"$f":"INDEX(Questions!E:K,MATCH(DE!G11,Questions!F:F,0),5)","v":"Level of confidence as an internet user"},{"$f":"INDEX(Questions!E:K,MATCH(DE!G11,Questions!F:F,0),7)","v":"How confident do you feel as an internet user\nPlease answer on a scale of 0 to 10, where 0 is ‘not at all confident and 10 is ‘very\nconfident\n\n1. 0 Not at all confident\n2. 1\n3. 2\n4. 3\n5. 4\n6. 5\n7. 6\n8. 7\n9. 8\n10. 9\n11. 10 Very confident\n12. Don’t know"},{"$f":"INDEX(Questions!E:K,MATCH(DE!G11,Questions!F:F,0),1)","v":"Y"},71]

{"sheet":"SSC","index":17,"n_rows":8,"n_cols":7,"rows_kept":8,"cut":false,"hidden":false,"merged":[[6,6,6,7]]}
[]
[null,null,"Adult Outcome Frameworks"]
[]
[null,"Mindset - Spending self-control"]
[null,"Select the questions that are relevant to your intervention -  use the first question for each indicator, "]
[null,"only use additional questions if that indicator is particularly important."]
[null,"Higher level outcome","Lower level outcome","Indicator","Question","Building Block Y/N","Question"]
[null,{"$f":"INDEX(Questions!E:K,MATCH(SSC!G8,Questions!F:F,0),3)","v":"Spending self-control"},{"$f":"INDEX(Questions!E:K,MATCH(SSC!G8,Questions!F:F,0),4)","v":0},{"$f":"INDEX(Questions!E:K,MATCH(SSC!G8,Questions!F:F,0),5)","v":"Level of self-control over spending"},{"$f":"INDEX(Questions!E:K,MATCH(SSC!G8,Questions!F:F,0),7)","v":"O4 To what extent would you say the following statements apply to you personally?\n\n\"I often buy things on impulse\"\n\"I feel under pressure to spend like my friends even when I can’t afford it\"\n\"I run short of money because I overspend\"\n\"I tend to buy things even when I can’t really afford them\"\n\"I find it more satisfying to spend money than to save it\"\n\n\n\n0 does not sound like me\n...\n10 sounds a lot like me\nDon't know\nNot applicable"},{"$f":"INDEX(Questions!E:K,MATCH(SSC!G8,Questions!F:F,0),1)","v":"Y"},94]

{"sheet":"EWTF","index":18,"n_rows":12,"n_cols":7,"rows_kept":12,"cut":false,"hidden":false,"merged":[[6,6,6,7]]}
[]
[null,null,"Adult Outcome Frameworks"]
[]
[null,"Mindset - Engagement with the future"]
[null,"Select the questions that are relevant to your intervention -  use the first question for each indicator, "]
[null,"only use additional questions if that indicator is particularly important."]
[null,"Higher level outcome","Lower level outcome","Indicator","Question","Building Block Y/N","Question"]
[null,{"$f":"INDEX(Questions!E:K,MATCH(EWTF!G8,Questions!F:F,0),3)","v":"Engagement with the future"},{"$f":"INDEX(Questions!E:K,MATCH(EWTF!G8,Questions!F:F,0),4)","v":0},{"$f":"INDEX(Questions!E:K,MATCH(EWTF!G8,Questions!F:F,0),5)","v":"Extent of engagement with the future"},{"$f":"INDEX(Questions!E:K,MATCH(EWTF!G8,Questions!F:F,0),7)","v":"To what extent would you say the following statements apply to you personally?\n\n\n\"When it comes to money, I focus on the long term\"\n\"When I make financial plans I do everything I can to succeed\"\n\"When it comes to money, I can pretty much determine what happens in my life\"\n\n\nPlease answer on a scale of 0 to 10, where 0 means it doesn’t sound like you at all and 10\nmeans it sounds a lot like you\n1. 0 Does not sound like me at all\n2. 1\n3. 2\n4. 3\n5. 4\n6. 5\n7. 6\n8. 7\n9. 8\n10. 9\n11. 10 Sounds a lot like me"},{"$f":"INDEX(Questions!E:K,MATCH(EWTF!G8,Questions!F:F,0),1)","v":"Y"},101]
[null,{"$f":"INDEX(Questions!E:K,MATCH(EWTF!G9,Questions!F:F,0),3)","v":"Engagement with the future"},{"$f":"INDEX(Questions!E:K,MATCH(EWTF!G9,Questions!F:F,0),4)","v":"Anticipate and plan for future financial needs including less positive scenarios "},{"$f":"INDEX(Questions!E:K,MATCH(EWTF!G9,Questions!F:F,0),5)","v":"Extent of plans for funding future care needs "},{"$f":"INDEX(Questions!E:K,MATCH(EWTF!G9,Questions!F:F,0),7)","v":"Have you thought about or made any plans for how you might fund the care and support you may need as you get older? This might include in-home support or a care home.\nCODES 3,4,5,6 CAN BE MULTICODE\n1. I haven't really thought about it\n2. I've thought about it but haven’t done anything specific\n3. I’m saving money which could pay for this (e.g. savings, pension or investments)\n4. I’ve taken out insurance cover to pay for this (e.g. long-term care plan)\n5. I could sell property to pay for this\n6. I hope my family would help fund this\n7. Other (please specify)\n8. Don't know"},{"$f":"INDEX(Questions!E:K,MATCH(EWTF!G9,Questions!F:F,0),1)","v":"N"},109]
[null,{"$f":"INDEX(Questions!E:K,MATCH(EWTF!G10,Questions!F:F,0),3)","v":"Engagement with the future"},{"$f":"INDEX(Questions!E:K,MATCH(EWTF!G10,Questions!F:F,0),4)","v":"Anticipate and plan for future financial needs including less positive scenarios "},{"$f":"INDEX(Questions!E:K,MATCH(EWTF!G10,Questions!F:F,0),5)","v":"Extent of plans for coping with income loss due to changes in tax or benefits"},{"$f":"INDEX(Questions!E:K,MATCH(EWTF!G10,Questions!F:F,0),7)","v":"Have you thought about or made any plans for how you might cope financially with an unexpected fall in your or your household’s income because of changes in tax or benefits?\nCODES 3,4,5,6 CAN BE MULTICODE\n1. I haven't really thought about it\n2. I've thought about it but haven’t done anything specific\n3. I’m saving money which could pay for this (e.g. savings, pension or investments)\n4. I could sell property to pay for this\n5. I hope family would help fund this\n6. Other (please specify)\n7. Don't know\n\n"},{"$f":"INDEX(Questions!E:K,MATCH(EWTF!G10,Questions!F:F,0),1)","v":"N"},110]
[null,{"$f":"INDEX(Questions!E:K,MATCH(EWTF!G11,Questions!F:F,0),3)","v":"Engagement with the future"},{"$f":"INDEX(Questions!E:K,MATCH(EWTF!G11,Questions!F:F,0),4)","v":"Anticipate and plan for future financial needs including less positive scenarios "},{"$f":"INDEX(Questions!E:K,MATCH(EWTF!G11,Questions!F:F,0),5)","v":"Extent of plans for coping with income loss due to redundancy or ill health"},{"$f":"INDEX(Questions!E:K,MATCH(EWTF!G11,Questions!F:F,0),7)","v":"Have you thought about or made any plans for how you might cope financially with an unexpected fall in your or your household’s income because of redundancy or ill-health?\nCODES 3,4,5,6,7 CAN BE MULTICODE\n1. I haven't really thought about it\n2. I've thought about it but haven’t done anything specific\n3. I’m saving money which could pay for this (e.g. savings, pension or investments)\n4. I’ve taken out insurance to pay for this \n5. I could sell property to pay for this\n6. I hope family would help fund this\n7. Other (please specify)\n8. Don't know\n"},{"$f":"INDEX(Questions!E:K,MATCH(EWTF!G11,Questions!F:F,0),1)","v":"N"},111]
[null,{"$f":"INDEX(Questions!E:K,MATCH(EWTF!G12,Questions!F:F,0),3)","v":"Engagement with the future"},{"$f":"INDEX(Questions!E:K,MATCH(EWTF!G12,Questions!F:F,0),4)","v":"Anticipate and plan for future financial needs including less positive scenarios "},{"$f":"INDEX(Questions!E:K,MATCH(EWTF!G12,Questions!F:F,0),5)","v":"Extent of plans for coping with a rise in mortgage repayments"},{"$f":"INDEX(Questions!E:K,MATCH(EWTF!G12,Questions!F:F,0),7)","v":"ONLY IF HAVE A MORTGAGE: 35. Have you thought about or made any plans for how you might cope financially if interest rates rise and your or your household’s mortgage repayments increase?\nCODES 3,4,5,6,7 CAN BE MULTICODE\n1. I haven't really thought about it\n2. I've thought about it but haven’t done anything specific\n3. I’m saving money which could pay for this (e.g. savings, pension or investments)\n4. I would switch to a new mortgage deal\n5. I could sell property to pay for this\n6. I hope family would help fund this\n7. Other (please specify)\n8. This won’t affect me – I’m on a fixed rate mortgage\n9. Don't know\n"},{"$f":"INDEX(Questions!E:K,MATCH(EWTF!G12,Questions!F:F,0),1)","v":"N"},112]

{"sheet":"EWAG","index":19,"n_rows":13,"n_cols":7,"rows_kept":13,"cut":false,"hidden":false,"merged":[[6,6,6,7]]}
[]
[null,null,"Adult Outcome Frameworks"]
[]
[null,"Mindset - Engagement with advice and guidance"]
[null,"Select the questions that are relevant to your intervention -  use the first question for each indicator, "]
[null,"only use additional questions if that indicator is particularly important."]
[null,"Higher level outcome","Lower level outcome","Indicator","Question","Building Block Y/N","Question"]
[null,{"$f":"INDEX(Questions!E:K,MATCH(EWAG!G8,Questions!F:F,0),3)","v":"Engagement with advice/guidance"},{"$f":"INDEX(Questions!E:K,MATCH(EWAG!G8,Questions!F:F,0),4)","v":0},{"$f":"INDEX(Questions!E:K,MATCH(EWAG!G8,Questions!F:F,0),5)","v":"Whether would consult external advice organisation"},{"$f":"INDEX(Questions!E:K,MATCH(EWAG!G8,Questions!F:F,0),7)","v":"Is consulting an advice organisation about debt something.....?\nPLEASE SELECT ONE ONLY\n\n1. You are currently doing\n2. You are planning to do soon\n3. You are thinking about doing in the future\n4. You don’t have any plans to do so but you might consider it\n5. You would consider if your situation got worse\n6. You cannot see yourself doing\n7. You would never consider\n8. Don’t know"},{"$f":"INDEX(Questions!E:K,MATCH(EWAG!G8,Questions!F:F,0),1)","v":"Y"},77]
[null,{"$f":"INDEX(Questions!E:K,MATCH(EWAG!G9,Questions!F:F,0),3)","v":"Engagement with advice/guidance"},{"$f":"INDEX(Questions!E:K,MATCH(EWAG!G9,Questions!F:F,0),4)","v":0},{"$f":"INDEX(Questions!E:K,MATCH(EWAG!G9,Questions!F:F,0),5)","v":"Sources of guidance used in last year (m301-m309)"},{"$f":"INDEX(Questions!E:K,MATCH(EWAG!G9,Questions!F:F,0),7)","v":"PRE. Which of the following sources of information have you used in the last year to find out about anything to do with money – whether that is how to budget or plan your finances, the best insurance, banking or credit products available, how to claim benefits or grants, or to get any help or advice, etc. \nPLEASE SELECT ALL THAT APPLY. \n\n1. Family / Friends \n2. Financial Pages in Newspapers/Magazines \n3. Bank / Insurance Company \n4. Broker/ Professional Advisor \n5. Internet – Price Comparison Websites e.g. GoCompare, Moneysupermarket, Comparethemarket, Confused etc. \n6. Internet – General Sites or Searches e.g. Google, Yahoo, BBC etc. \n7. Internet – Specialist Site e.g. moneysavingexpert.com, \n8. Government/ Non-Government Funded Org’s (e.g. Citizens Advice / CAB) \n9. Other \n10. None of these \n11. Don’t know\n\nPOST. Which of the following sources of information have you used since [REFERENCE POINT] to find out about anything to do with money – whether that is how to budget or plan your finances, the best insurance, banking or credit products available, how to claim benefits or grants, or to get any help or advice, etc. \nPLEASE SELECT ALL THAT APPLY. \n\n1. Family / Friends \n2. Financial Pages in Newspapers/Magazines \n3. Bank / Insurance Company \n4. Broker/ Professional Advisor \n5. Internet – Price Comparison Websites e.g. GoCompare, Moneysupermarket, Comparethemarket, Confused etc. \n6. Internet – General Sites or Searches e.g. Google, Yahoo, BBC etc. \n7. Internet – Specialist Site e.g. moneysavingexpert.com, \n8. Government/ Non-Government Funded Org’s (e.g. Citizens Advice / CAB) \n9. Other \n10. None of these \n11. Don’t know"},{"$f":"INDEX(Questions!E:K,MATCH(EWAG!G9,Questions!F:F,0),1)","v":"Y"},78]
[null,{"$f":"INDEX(Questions!E:K,MATCH(EWAG!G10,Questions!F:F,0),3)","v":"Engagement with advice/guidance"},{"$f":"INDEX(Questions!E:K,MATCH(EWAG!G10,Questions!F:F,0),4)","v":0},{"$f":"INDEX(Questions!E:K,MATCH(EWAG!G10,Questions!F:F,0),5)","v":"Awareness of organisations and websites that offer free advice/guidance"},{"$f":"INDEX(Questions!E:K,MATCH(EWAG!G10,Questions!F:F,0),7)","v":"How aware are you of organisations and websites that can offer free or affordable financial information, help and support to people when they are making financial decisions? \n\n1. I know of a few organisations / sources that offer such services and know how to find them 76 \n2. I know such organisations / sources exist and am sure I could find them if I need to \n3. I assume such organisations / sources exist and that I could find them if I need to \n4. I am not sure if such organisations / sources exist or whether I could find them \n5. I don’t think these organisations / sources exist and wouldn’t know how to find them if they did \n6. Don’t know"},{"$f":"INDEX(Questions!E:K,MATCH(EWAG!G10,Questions!F:F,0),1)","v":"Y"},79]
[null,{"$f":"INDEX(Questions!E:K,MATCH(EWAG!G11,Questions!F:F,0),3)","v":"Engagement with advice/guidance"},{"$f":"INDEX(Questions!E:K,MATCH(EWAG!G11,Questions!F:F,0),4)","v":"Belief that money advice and guidance can help them"},{"$f":"INDEX(Questions!E:K,MATCH(EWAG!G11,Questions!F:F,0),5)","v":"Likelihood of seeking money advice and guidance"},{"$f":"INDEX(Questions!E:K,MATCH(EWAG!G11,Questions!F:F,0),7)","v":"How likely are you to take advice about dealing with money issues from a free advice organisation to deal with money worries? This could include Citizen's Advice Bureau, Money Advice Service or StepChange.\n\nCHOOSE ONE ONLY\n\n1. Very likely\n2. Fairly likely\n3. Fairly unlikely\n4. Very unlikely\n5. Don’t know\n"},{"$f":"INDEX(Questions!E:K,MATCH(EWAG!G11,Questions!F:F,0),1)","v":"N"},75]
[null,{"$f":"INDEX(Questions!E:K,MATCH(EWAG!G12,Questions!F:F,0),3)","v":"Engagement with advice/guidance"},{"$f":"INDEX(Questions!E:K,MATCH(EWAG!G12,Questions!F:F,0),4)","v":"Belief that money advice and guidance can help them"},{"$f":"INDEX(Questions!E:K,MATCH(EWAG!G12,Questions!F:F,0),5)","v":"Attitude towards money advice and guidance "},{"$f":"INDEX(Questions!E:K,MATCH(EWAG!G12,Questions!F:F,0),7)","v":"How much do you agree or disagree with each of the following statements? When we say advice and guidance, we mean from organisations like Citizen's Advice Bureau, Money Advice Service or StepChange and also from accountants and independent financial advisers\n\n• Asking for financial advice and guidance seems too scary \n• I’d feel embarrassed to take financial advice and guidance\n• I’d make better financial decisions with financial advice and guidance\n• I can sort out my own money issues, without financial advice and guidance\n• When it comes to things like bank accounts, credit cards or insurance, there’s not enough information out there I can trust\n"},{"$f":"INDEX(Questions!E:K,MATCH(EWAG!G12,Questions!F:F,0),1)","v":"N"},76]
[null,{"$f":"INDEX(Questions!E:K,MATCH(EWAG!G13,Questions!F:F,0),3)","v":"Confidence communicating with financial professionals "},{"$f":"INDEX(Questions!E:K,MATCH(EWAG!G13,Questions!F:F,0),4)","v":" "},{"$f":"INDEX(Questions!E:K,MATCH(EWAG!G13,Questions!F:F,0),5)","v":"Confidence talking to professionals about money"},{"$f":"INDEX(Questions!E:K,MATCH(EWAG!G13,Questions!F:F,0),7)","v":"How confident would you feel talking to people who can give you advice about money\n\n1.Very confident \n2. Fairly confident \n3. Not very confident \n4. Not at all confident\n5. Don't know\n"},{"$f":"INDEX(Questions!E:K,MATCH(EWAG!G13,Questions!F:F,0),1)","v":"N"},80]

{"sheet":"EWM","index":20,"n_rows":9,"n_cols":7,"rows_kept":9,"cut":false,"hidden":false,"merged":[[6,6,6,7]]}
[]
[null,null,"Adult Outcome Frameworks"]
[]
[null,"Mindset - Engagement with money"]
[null,"Select the questions that are relevant to your intervention -  use the first question for each indicator, "]
[null,"only use additional questions if that indicator is particularly important."]
[null,"Higher level outcome","Lower level outcome","Indicator","Question","Building Block Y/N","Question"]
[null,{"$f":"INDEX(Questions!E:K,MATCH(EWM!G8,Questions!F:F,0),3)","v":"Engagement with money"},{"$f":"INDEX(Questions!E:K,MATCH(EWM!G8,Questions!F:F,0),4)","v":" "},{"$f":"INDEX(Questions!E:K,MATCH(EWM!G8,Questions!F:F,0),5)","v":"Extent of engagement with money"},{"$f":"INDEX(Questions!E:K,MATCH(EWM!G8,Questions!F:F,0),7)","v":"To what extent do you agree or disagree with the\nstatement \n\n\"When it comes to money I prefer to live for today\nrather than plan for tomorrow -\" \n \"Nothing I do will make much difference to my financial situation\"\n\"I am too busy to sort out my finances at the moment\"\n\n1. Strongly agree\n2. Tend to agree\n3. Neither agree nor disagree\n4. Tend to disagree\n5. Strongly disagree\n6. Don’t know\n"},{"$f":"INDEX(Questions!E:K,MATCH(EWM!G8,Questions!F:F,0),1)","v":"Y"},99]
[null,{"$f":"INDEX(Questions!E:K,MATCH(EWM!G9,Questions!F:F,0),3)","v":"Engagement with money"},{"$f":"INDEX(Questions!E:K,MATCH(EWM!G9,Questions!F:F,0),4)","v":0},{"$f":"INDEX(Questions!E:K,MATCH(EWM!G9,Questions!F:F,0),5)","v":"Extent of engagement with money"},{"$f":"INDEX(Questions!E:K,MATCH(EWM!G9,Questions!F:F,0),7)","v":"To what extent would you say the following statements apply to you personally? When it comes to money, the future will take care of itself. \nPlease answer on a scale of 0 to 10, where 0 means it doesn’t sound like you at all and 10 means it sounds a lot like you \n1. 0 Does not sound like me at all \n2. 1 \n3. 2 \n4. 3 \n5. 4\n6. 5 \n7. 6 \n8. 7 \n9. 8 \n10. 9 \n11. 10 Sounds a lot like me"},{"$f":"INDEX(Questions!E:K,MATCH(EWM!G9,Questions!F:F,0),1)","v":"Y"},100]

{"sheet":"CFR","index":21,"n_rows":10,"n_cols":7,"rows_kept":10,"cut":false,"hidden":false,"merged":[[6,6,6,7]]}
[]
[null,null,"Adult Outcome Frameworks"]
[]
[null,"Mindset - Confidence for retirement"]
[null,"Select the questions that are relevant to your intervention -  use the first question for each indicator, "]
[null,"only use additional questions if that indicator is particularly important."]
[null,"Higher level outcome","Lower level outcome","Indicator","Question","Building Block Y/N","Question"]
[null,{"$f":"INDEX(Questions!E:K,MATCH(CFR!G8,Questions!F:F,0),3)","v":"Confidence for retirement"},{"$f":"INDEX(Questions!E:K,MATCH(CFR!G8,Questions!F:F,0),4)","v":"Understand enough to make decisions about retirement"},{"$f":"INDEX(Questions!E:K,MATCH(CFR!G8,Questions!F:F,0),5)","v":0},{"$f":"INDEX(Questions!E:K,MATCH(CFR!G8,Questions!F:F,0),7)","v":"Do you agree or disagree ….?\n\nI feel I understand enough about pensions to make decisions about saving for\nretirement\n\n1. Strongly agree\n2. Tend to agree\n3. Neither agree nor disagree\n4. Tend to disagree\n5. Strongly disagree\n6. Don’t know"},{"$f":"INDEX(Questions!E:K,MATCH(CFR!G8,Questions!F:F,0),1)","v":"Y"},104]
[null,{"$f":"INDEX(Questions!E:K,MATCH(CFR!G9,Questions!F:F,0),3)","v":"Confidence for retirement"},{"$f":"INDEX(Questions!E:K,MATCH(CFR!G9,Questions!F:F,0),4)","v":"How much of an idea about financial situation when retire"},{"$f":"INDEX(Questions!E:K,MATCH(CFR!G9,Questions!F:F,0),5)","v":0},{"$f":"INDEX(Questions!E:K,MATCH(CFR!G9,Questions!F:F,0),7)","v":"How much of an idea do you have about what your financial situation will be in retirement? \n\n1. Very good idea \n2. Fairly good idea \n3. Not much idea \n4. No idea at all \n5. Don’t know"},{"$f":"INDEX(Questions!E:K,MATCH(CFR!G9,Questions!F:F,0),1)","v":"Y"},105]
[null,{"$f":"INDEX(Questions!E:K,MATCH(CFR!G10,Questions!F:F,0),3)","v":"Confidence for retirement"},{"$f":"INDEX(Questions!E:K,MATCH(CFR!G10,Questions!F:F,0),4)","v":"How confident planning for your financial future"},{"$f":"INDEX(Questions!E:K,MATCH(CFR!G10,Questions!F:F,0),5)","v":0},{"$f":"INDEX(Questions!E:K,MATCH(CFR!G10,Questions!F:F,0),7)","v":"How confident do you feel planning for your financial future?\nPlease answer on a scale of 0 to 10, where 0 is ‘not at all confident and 10 is ‘very\nconfident\n\n1. 0 Not at all confident\n2. 1\n3. 2\n4. 3\n5. 4\n6. 5\n7. 6\n8. 7\n9. 8\n10. 9\n11. 10 Very confident\n12. Don’t know\n"},{"$f":"INDEX(Questions!E:K,MATCH(CFR!G10,Questions!F:F,0),1)","v":"Y"},106]

{"sheet":"WTTAM","index":22,"n_rows":8,"n_cols":7,"rows_kept":8,"cut":false,"hidden":false,"merged":[[6,6,6,7]]}
[]
[null,null,"Adult Outcome Frameworks"]
[]
[null,"Mindset - Willingness to talk about money"]
[null,"Select the questions that are relevant to your intervention -  use the first question for each indicator, "]
[null,"only use additional questions if that indicator is particularly important."]
[null,"Higher level outcome","Lower level outcome","Indicator","Question","Building Block Y/N","Question"]
[null,{"$f":"INDEX(Questions!E:K,MATCH(WTTAM!G8,Questions!F:F,0),3)","v":"Willing to talk openly and honestly about money with friends and family"},{"$f":"INDEX(Questions!E:K,MATCH(WTTAM!G8,Questions!F:F,0),4)","v":" "},{"$f":"INDEX(Questions!E:K,MATCH(WTTAM!G8,Questions!F:F,0),5)","v":"Willingness to talk about money with friends and family\n"},{"$f":"INDEX(Questions!E:K,MATCH(WTTAM!G8,Questions!F:F,0),7)","v":"How much do you agree or disagree with each of the following statements?  \n\n - I would be too embarrassed to discuss my financial situation\n \n- I would talk to family and friends before making an important financial decision\n\n1. Strongly agree\n2. Tend to agree\n3. Neither agree nor disagree\n4. Tend to disagree\n5. Strongly disagree\n6. Don’t know\n"},{"$f":"INDEX(Questions!E:K,MATCH(WTTAM!G8,Questions!F:F,0),1)","v":"N"},107]

{"sheet":"FN","index":23,"n_rows":10,"n_cols":7,"rows_kept":10,"cut":false,"hidden":false,"merged":[[6,6,6,7]]}
[]
[null,null,"Adult Outcome Frameworks"]
[]
[null,"Ability - Financial Numeracy"]
[null,"Select the questions that are relevant to your intervention -  use the first question for each indicator, "]
[null,"only use additional questions if that indicator is particularly important."]
[null,"Higher level outcome","Lower level outcome","Indicator","Question","Building Block Y/N","Question"]
[null,{"$f":"INDEX(Questions!E:K,MATCH(FN!G8,Questions!F:F,0),3)","v":"Financial numeracy"},{"$f":"INDEX(Questions!E:K,MATCH(FN!G8,Questions!F:F,0),4)","v":"Understand financial concepts and are able to answer basic questions around\ninterest rates"},{"$f":"INDEX(Questions!E:K,MATCH(FN!G8,Questions!F:F,0),5)","v":"Ability to calculate interest earned from savings\n"},{"$f":"INDEX(Questions!E:K,MATCH(FN!G8,Questions!F:F,0),7)","v":"QUIZ Suppose you put £100 into a savings account with a guaranteed interest rate of 2% per year. You don’t make any further payments into this account and you don’t withdraw any money.\n\nHow much would be in the account at the end of the first year, once the interest payment is made?\n\nAnd how much would be in the account at the end of five years (remembering there are\nno fees or tax deductions). Would it be..?\n1. More than £110\n2. Exactly £110\n3. Less than £110\n4. Or is it impossible to tell from the information given\n5. Don’t know\n"},{"$f":"INDEX(Questions!E:K,MATCH(FN!G8,Questions!F:F,0),1)","v":"Y"},113]
[null,{"$f":"INDEX(Questions!E:K,MATCH(FN!G9,Questions!F:F,0),3)","v":"Financial numeracy"},{"$f":"INDEX(Questions!E:K,MATCH(FN!G9,Questions!F:F,0),4)","v":"Understand financial concepts and are able to answer basic questions around\ninterest rates"},{"$f":"INDEX(Questions!E:K,MATCH(FN!G9,Questions!F:F,0),5)","v":"Ability to calculate interest owed on a loan"},{"$f":"INDEX(Questions!E:K,MATCH(FN!G9,Questions!F:F,0),7)","v":"QUIZ You have taken out a loan for £500, and the interest rate you are charged is 10 percent per month. There are no other fees. At this interest rate, how much money would you owe in total after one month?\n\nA £505\nB £550\nC £510\nD £600\n"},{"$f":"INDEX(Questions!E:K,MATCH(FN!G9,Questions!F:F,0),1)","v":"N"},114]
[null,{"$f":"INDEX(Questions!E:K,MATCH(FN!G10,Questions!F:F,0),3)","v":"Financial numeracy"},{"$f":"INDEX(Questions!E:K,MATCH(FN!G10,Questions!F:F,0),4)","v":"Understand financial concepts and are able to answer basic questions around\ninflation"},{"$f":"INDEX(Questions!E:K,MATCH(FN!G10,Questions!F:F,0),5)","v":"Understanding of the impact of inflation on buying power"},{"$f":"INDEX(Questions!E:K,MATCH(FN!G10,Questions!F:F,0),7)","v":"QUIZ If the inflation rate is 5% and the interest rate you get on your savings is 3%, will your savings have more, less or the same amount of buying power in a year’s time?\n1. More\n2. The same\n3. Less\n4. Don’t know"},{"$f":"INDEX(Questions!E:K,MATCH(FN!G10,Questions!F:F,0),1)","v":"Y"},115]

{"sheet":"UFCAP","index":24,"n_rows":20,"n_cols":7,"rows_kept":20,"cut":false,"hidden":false,"merged":[[6,6,6,7]]}
[]
[null,null,"Adult Outcome Frameworks"]
[]
[null,"Ability - Understanding financial concepts and products"]
[null,"Select the questions that are relevant to your intervention -  use the first question for each indicator, "]
[null,"only use additional questions if that indicator is particularly important."]
[null,"Higher level outcome","Lower level outcome","Indicator","Question","Building Block Y/N","Question"]
[null,{"$f":"INDEX(Questions!E:K,MATCH(UFCAP!G8,Questions!F:F,0),3)","v":"Understand financial concepts and products  "},{"$f":"INDEX(Questions!E:K,MATCH(UFCAP!G8,Questions!F:F,0),4)","v":"Understand different loan types and interest on borrowing"},{"$f":"INDEX(Questions!E:K,MATCH(UFCAP!G8,Questions!F:F,0),5)","v":"Understanding of loan types and calculating interest"},{"$f":"INDEX(Questions!E:K,MATCH(UFCAP!G8,Questions!F:F,0),7)","v":"STEM Which of these statements best describes how knowledgeable you feel about: \n\n- comparing different loans and credit cards\n- credit unions \n- calculating the total cost of a loan or credit such as Brighthouse or a car on hire purchase (including interest and charges)  \n\n1. I have an excellent knowledge\n2. I have a good knowledge\n3. I have a basic knowledge\n4. I know nothing about this\n5. Not applicable"},{"$f":"INDEX(Questions!E:K,MATCH(UFCAP!G8,Questions!F:F,0),1)","v":"N"},116]
[null,{"$f":"INDEX(Questions!E:K,MATCH(UFCAP!G9,Questions!F:F,0),3)","v":"Understand financial concepts and products  "},{"$f":"INDEX(Questions!E:K,MATCH(UFCAP!G9,Questions!F:F,0),4)","v":"Understand different loan types and interest on borrowing"},{"$f":"INDEX(Questions!E:K,MATCH(UFCAP!G9,Questions!F:F,0),5)","v":"Understanding of APR"},{"$f":"INDEX(Questions!E:K,MATCH(UFCAP!G9,Questions!F:F,0),7)","v":"QUIZ I would like to know whether you think the following statements are true or false.....\n\n - For a six month loan, it will cost you more to borrow money on a loan with a low APR than a loan with a high APR\n\nTrue\nFalse\nDon't know"},{"$f":"INDEX(Questions!E:K,MATCH(UFCAP!G9,Questions!F:F,0),1)","v":"N"},117]
[null,{"$f":"INDEX(Questions!E:K,MATCH(UFCAP!G10,Questions!F:F,0),3)","v":"Understand financial concepts and products "},{"$f":"INDEX(Questions!E:K,MATCH(UFCAP!G10,Questions!F:F,0),4)","v":"Understand investments "},{"$f":"INDEX(Questions!E:K,MATCH(UFCAP!G10,Questions!F:F,0),5)","v":"Understanding of investments \n\n"},{"$f":"INDEX(Questions!E:K,MATCH(UFCAP!G10,Questions!F:F,0),7)","v":"QUIZ I would like to know whether you think the following statements are true or false.....\n\n - An investment with a high return is likely to be low risk\n - It is usually possible to reduce the risk of investing in the stock market by buying a wide range of stocks and shares. \n\nTrue\nFalse\nDon't know"},{"$f":"INDEX(Questions!E:K,MATCH(UFCAP!G10,Questions!F:F,0),1)","v":"N"},118]
[null,{"$f":"INDEX(Questions!E:K,MATCH(UFCAP!G11,Questions!F:F,0),3)","v":"Understanding financial concepts, products and situations"},{"$f":"INDEX(Questions!E:K,MATCH(UFCAP!G11,Questions!F:F,0),4)","v":"Understand bank accounts "},{"$f":"INDEX(Questions!E:K,MATCH(UFCAP!G11,Questions!F:F,0),5)","v":"Knowledge of bank accounts and ability to check bank balance"},{"$f":"INDEX(Questions!E:K,MATCH(UFCAP!G11,Questions!F:F,0),7)","v":"STEM: Which of these statements best describes how knowledgeable you feel about: \n\n- bank accounts\n- checking the balance on your bank account\n\n1. I have an excellent knowledge\n2. I have a good knowledge\n3. I have a basic knowledge\n4. I know nothing about this\n5. Not applicable"},{"$f":"INDEX(Questions!E:K,MATCH(UFCAP!G11,Questions!F:F,0),1)","v":"N"},119]
[null,{"$f":"INDEX(Questions!E:K,MATCH(UFCAP!G12,Questions!F:F,0),3)","v":"Understanding financial concepts, products and situations"},{"$f":"INDEX(Questions!E:K,MATCH(UFCAP!G12,Questions!F:F,0),4)","v":"Understand different insurance products and can assess which options are right for them"},{"$f":"INDEX(Questions!E:K,MATCH(UFCAP!G12,Questions!F:F,0),5)","v":"Understanding of insurance and ability to compare insurance products\n"},{"$f":"INDEX(Questions!E:K,MATCH(UFCAP!G12,Questions!F:F,0),7)","v":"STEM: Which of these statements best describes how knowledgeable you feel about: \n\n- insurance\n- comparing different types of insurance\n\n1. I have an excellent knowledge\n2. I have a good knowledge\n3. I have a basic knowledge\n4. I know nothing about this\n5. Not applicable"},{"$f":"INDEX(Questions!E:K,MATCH(UFCAP!G12,Questions!F:F,0),1)","v":"N"},120]
[null,{"$f":"INDEX(Questions!E:K,MATCH(UFCAP!G13,Questions!F:F,0),3)","v":"Understanding financial concepts, products and situations"},{"$f":"INDEX(Questions!E:K,MATCH(UFCAP!G13,Questions!F:F,0),4)","v":"Understand different types of savings vehicles, and can assess which options are right for them"},{"$f":"INDEX(Questions!E:K,MATCH(UFCAP!G13,Questions!F:F,0),5)","v":"Understanding of savings accounts and ability to compare savings products"},{"$f":"INDEX(Questions!E:K,MATCH(UFCAP!G13,Questions!F:F,0),7)","v":"STEM: Which of these statements best describes how knowledgeable you feel about: \n- savings accounts \n- credit unions \n- comparing savings products  \n1. I have an excellent knowledge\n2. I have a good knowledge\n3. I have a basic knowledge\n4. I know nothing about this\n5. Not applicable"},{"$f":"INDEX(Questions!E:K,MATCH(UFCAP!G13,Questions!F:F,0),1)","v":"N "},121]
[null,{"$f":"INDEX(Questions!E:K,MATCH(UFCAP!G14,Questions!F:F,0),3)","v":"Understanding financial concepts, products and options relevant to their issue, life stage or event"},{"$f":"INDEX(Questions!E:K,MATCH(UFCAP!G14,Questions!F:F,0),4)","v":"Understand concepts, products and options relavent to their pension"},{"$f":"INDEX(Questions!E:K,MATCH(UFCAP!G14,Questions!F:F,0),5)","v":"Knowledge of pensions, ability to check and make decisions about pensions\n\n"},{"$f":"INDEX(Questions!E:K,MATCH(UFCAP!G14,Questions!F:F,0),7)","v":"STEM: Which of these statements best describes how knowledgeable you feel about: \n- pensions\n- checking how much pension income you will get when you retire\n- making decisions about a pension to give you an income you require in retirement \n1. I have an excellent knowledge\n2. I have a good knowledge\n3. I have a basic knowledge\n4. I know nothing about this\n5. Not applicable"},{"$f":"INDEX(Questions!E:K,MATCH(UFCAP!G14,Questions!F:F,0),1)","v":"N"},122]
[null,{"$f":"INDEX(Questions!E:K,MATCH(UFCAP!G15,Questions!F:F,0),3)","v":"Understanding financial concepts, products and options relevant to their issue, life stage or event"},{"$f":"INDEX(Questions!E:K,MATCH(UFCAP!G15,Questions!F:F,0),4)","v":"Understand concepts, products and options relevant to their mortgage"},{"$f":"INDEX(Questions!E:K,MATCH(UFCAP!G15,Questions!F:F,0),5)","v":"Understanding of mortgages and mortgage repayments "},{"$f":"INDEX(Questions!E:K,MATCH(UFCAP!G15,Questions!F:F,0),7)","v":"STEM: Which of these statements best describes how knowledgeable you feel about:  \n- mortgages\n- applying for a mortgage\n- calculating you monthly mortgage repayments if interest rates rise\n1. I have an excellent knowledge\n2. I have a good knowledge\n3. I have a basic knowledge\n4. I know nothing about this\n5. Not applicable"},{"$f":"INDEX(Questions!E:K,MATCH(UFCAP!G15,Questions!F:F,0),1)","v":"N "},123]
[null,{"$f":"INDEX(Questions!E:K,MATCH(UFCAP!G16,Questions!F:F,0),3)","v":"Understanding financial concepts, products and options relevant to their issue, life stage or event"},{"$f":"INDEX(Questions!E:K,MATCH(UFCAP!G16,Questions!F:F,0),4)","v":"Understand concepts, products and options relevant to problem debt"},{"$f":"INDEX(Questions!E:K,MATCH(UFCAP!G16,Questions!F:F,0),5)","v":"Knowledge of options and rights in relation to problem debt"},{"$f":"INDEX(Questions!E:K,MATCH(UFCAP!G16,Questions!F:F,0),7)","v":"STEM: Which of these statements best describes how knowledgeable you feel about:  \n- the different options for sorting out debt problems\n- the fees charged for debt solutions such as bankruptcy, Debt Relief Orders and Debt Management Plans\n- the steps I should take if I’m unable to pay my debts \n- my rights when companies try to recover money I owe them\n- the steps companies can take to recover the money I owe them\n1. I have an excellent knowledge\n2. I have a good knowledge\n3. I have a basic knowledge\n4. I know nothing about this\n5. Not applicable\n\n\n"},{"$f":"INDEX(Questions!E:K,MATCH(UFCAP!G16,Questions!F:F,0),1)","v":"N"},124]
[null,{"$f":"INDEX(Questions!E:K,MATCH(UFCAP!G17,Questions!F:F,0),3)","v":"Understanding financial concepts, products and situations"},{"$f":"INDEX(Questions!E:K,MATCH(UFCAP!G17,Questions!F:F,0),4)","v":"Understand the main types of financial fraud and how to protect themselves from it"},{"$f":"INDEX(Questions!E:K,MATCH(UFCAP!G17,Questions!F:F,0),5)","v":"Knowledge about types of fraud and ability to protect from fraud "},{"$f":"INDEX(Questions!E:K,MATCH(UFCAP!G17,Questions!F:F,0),7)","v":"STEM: Which of these statements best describes how knowledgeable you feel about:  \n- different types of financial fraud/scams \n- protecting yourself from financial fraud / scams\n- protecting yourself from online financial fraud / scams\n\n1. I have an excellent knowledge\n2. I have a good knowledge\n3. I have a basic knowledge\n4. I know nothing about this\n5. Not applicable\n"},{"$f":"INDEX(Questions!E:K,MATCH(UFCAP!G17,Questions!F:F,0),1)","v":"N "},127]
[null,{"$f":"INDEX(Questions!E:K,MATCH(UFCAP!G18,Questions!F:F,0),3)","v":"Understanding money management"},{"$f":"INDEX(Questions!E:K,MATCH(UFCAP!G18,Questions!F:F,0),4)","v":"Understand the principles of budgeting and can develop a budget suited to their needs"},{"$f":"INDEX(Questions!E:K,MATCH(UFCAP!G18,Questions!F:F,0),5)","v":"Ability to create a weekly or monthly budget "},{"$f":"INDEX(Questions!E:K,MATCH(UFCAP!G18,Questions!F:F,0),7)","v":"STEM: Which of these statements best describes how knowledgeable you feel about: \n- creating a weekly or monthly household budget\n\n1. I have an excellent knowledge\n2. I have a good knowledge\n3. I have a basic knowledge\n4. I know nothing about this\n5. Not applicable\n"},{"$f":"INDEX(Questions!E:K,MATCH(UFCAP!G18,Questions!F:F,0),1)","v":"N "},128]
[null,{"$f":"INDEX(Questions!E:K,MATCH(UFCAP!G19,Questions!F:F,0),3)","v":"Understanding money management"},{"$f":"INDEX(Questions!E:K,MATCH(UFCAP!G19,Questions!F:F,0),4)","v":"Knowing how to make their money go further"},{"$f":"INDEX(Questions!E:K,MATCH(UFCAP!G19,Questions!F:F,0),5)","v":"Ability to use a price comparison site "},{"$f":"INDEX(Questions!E:K,MATCH(UFCAP!G19,Questions!F:F,0),7)","v":"STEM: Which of these statements best describes how knowledgeable you feel about: \n - using a price comparison website \n\n1. I have an excellent knowledge\n2. I have a good knowledge\n3. I have a basic knowledge\n4. I know nothing about this\n5. Not applicable\n\n"},{"$f":"INDEX(Questions!E:K,MATCH(UFCAP!G19,Questions!F:F,0),1)","v":"N"},129]
[null,{"$f":"INDEX(Questions!E:K,MATCH(UFCAP!G20,Questions!F:F,0),3)","v":"Understanding money management"},{"$f":"INDEX(Questions!E:K,MATCH(UFCAP!G20,Questions!F:F,0),4)","v":"Knowing how to make their money go further"},{"$f":"INDEX(Questions!E:K,MATCH(UFCAP!G20,Questions!F:F,0),5)","v":"Ability to check benefits entitlements and tax payments"},{"$f":"INDEX(Questions!E:K,MATCH(UFCAP!G20,Questions!F:F,0),7)","v":"STEM: Which of these statements best describes how knowledgeable you feel about: \n- checking you’re getting all benefits you are entitled to\n- checking you’re paying the correct amount of tax\n\n1. I have an excellent knowledge\n2. I have a good knowledge\n3. I have a basic knowledge\n4. I know nothing about this\n5. Not applicable\n\n"},{"$f":"INDEX(Questions!E:K,MATCH(UFCAP!G20,Questions!F:F,0),1)","v":"N"},130]

{"sheet":"KWAAG","index":25,"n_rows":9,"n_cols":7,"rows_kept":9,"cut":false,"hidden":false,"merged":[[6,6,6,7]]}
[]
[null,null,"Adult Outcome Frameworks"]
[]
[null,"Ability - Knowledge of where to access advice and guidance"]
[null,"Select the questions that are relevant to your intervention -  use the first question for each indicator, "]
[null,"only use additional questions if that indicator is particularly important."]
[null,"Higher level outcome","Lower level outcome","Indicator","Question","Building Block Y/N","Question"]
[null,{"$f":"INDEX(Questions!E:K,MATCH(KWAAG!G8,Questions!F:F,0),3)","v":"Knowledge of where to go for advice, guidance and tools about their financial situation, in person, by phone and using digital resources"},{"$f":"INDEX(Questions!E:K,MATCH(KWAAG!G8,Questions!F:F,0),4)","v":" "},{"$f":"INDEX(Questions!E:K,MATCH(KWAAG!G8,Questions!F:F,0),5)","v":"Awareness of different advice providers "},{"$f":"INDEX(Questions!E:K,MATCH(KWAAG!G8,Questions!F:F,0),7)","v":"Which, if any, of these providers of advice on your money you have ever heard of, even if you’re not very familiar with them?\n\nSELECT ALL THAT APPLY\n\n1. Money Advice Service\n2.Citizen’s Advice Bureau\n3.Money Sense\n4.Which?\n5.Money Saving Expert (Martin Lewis)\n6.Other price comparison sites (e.g. Moneysupermarket, Comparethemarket)\n7.Directgov (gov.co.uk)\n8. Consumer Credit Counselling Service (CCCS)/StepChange\n9. National Debtline\n[ADD OTHER RELEVANT ORGANISATIONS/SITES]\n11. None of these\n"},{"$f":"INDEX(Questions!E:K,MATCH(KWAAG!G8,Questions!F:F,0),1)","v":"N"},125]
[null,{"$f":"INDEX(Questions!E:K,MATCH(KWAAG!G9,Questions!F:F,0),3)","v":"Knowledge of where to go for advice, guidance and tools about their financial situation, in person, by phone and using digital resources"},{"$f":"INDEX(Questions!E:K,MATCH(KWAAG!G9,Questions!F:F,0),4)","v":" "},{"$f":"INDEX(Questions!E:K,MATCH(KWAAG!G9,Questions!F:F,0),5)","v":"Knowledge of how to access money advice"},{"$f":"INDEX(Questions!E:K,MATCH(KWAAG!G9,Questions!F:F,0),7)","v":"STEM: Which of these statements best describes how knowledgeable you feel about:  \n- where to get  advice if you need help with your finances\n\n1. I have an excellent knowledge\n2. I have a good knowledge\n3. I have a basic knowledge\n4. I know nothing about this\n5. Not applicable"},{"$f":"INDEX(Questions!E:K,MATCH(KWAAG!G9,Questions!F:F,0),1)","v":"N"},126]

{"sheet":"BS","index":26,"n_rows":12,"n_cols":7,"rows_kept":12,"cut":false,"hidden":false,"merged":[[6,6,6,7]]}
[]
[null,null,"Adult Outcome Frameworks"]
[]
[null,"Basic skills: Numeracy, digital, communication"]
[null,"Select the questions that are relevant to your intervention -  use the first question for each indicator, "]
[null,"only use additional questions if that indicator is particularly important."]
[null,"Higher level outcome","Lower level outcome","Indicator","Question","Building Block Y/N","Question"]
[null,{"$f":"INDEX(Questions!E:K,MATCH(BS!G8,Questions!F:F,0),3)","v":"Basic skills: Literacy"},{"$f":"INDEX(Questions!E:K,MATCH(BS!G8,Questions!F:F,0),4)","v":"People have the level of literacy needed to fill in forms and read information about financial products in English (or Welsh in Wales)"},{"$f":"INDEX(Questions!E:K,MATCH(BS!G8,Questions!F:F,0),5)","v":"Level of literacy "},{"$f":"INDEX(Questions!E:K,MATCH(BS!G8,Questions!F:F,0),7)","v":"How good are you at each of the following:\n\na)  writing in English when you need to in daily life? For example: writing letters or notes or filling in official forms?\nb) reading in English when you need to? For example\nreading newspapers and magazines or reading letters, paperwork or forms?\n\n1. Very good \n2. Fairly good \n3. Below average \n4. Poor \n5. No opinion. \n6, Don't Know  "},{"$f":"INDEX(Questions!E:K,MATCH(BS!G8,Questions!F:F,0),1)","v":"N"},131]
[null,{"$f":"INDEX(Questions!E:K,MATCH(BS!G9,Questions!F:F,0),3)","v":"Basic skills: Digital Literacy"},{"$f":"INDEX(Questions!E:K,MATCH(BS!G9,Questions!F:F,0),4)","v":"Able to use financial/money-related online services eg. forms, tools, emails, and online banking\n"},{"$f":"INDEX(Questions!E:K,MATCH(BS!G9,Questions!F:F,0),5)","v":"Ability to carry out financial tasks and transactions online "},{"$f":"INDEX(Questions!E:K,MATCH(BS!G9,Questions!F:F,0),7)","v":"A) Do you access to the internet at home or elsewhere?\nYes\nNo\nDon't know\n\nIF DO HAVE ACCESS\nB) STEM I’d like you to think about different commercial transactions people do in their everyday lives like banking or shopping. How how knowledgeable you feel about: \na) Buying a product online\nb) Making travel reservations/bookings\nc) Paying bills\nd) Using your bank’s online services\ne) Comparing products and services\nf) Ordering groceries or food online\ng) Selling things online\nh) Finding the location of a house,  office, store or restaurant \n\n1. I have an excellent knowledge\n2. I have a good knowledge\n3. I have a basic knowledge\n4. I know nothing about this\n5. Not applicable"},{"$f":"INDEX(Questions!E:K,MATCH(BS!G9,Questions!F:F,0),1)","v":"N"},132]
[null,{"$f":"INDEX(Questions!E:K,MATCH(BS!G10,Questions!F:F,0),3)","v":"Basic skills: Digital Literacy"},{"$f":"INDEX(Questions!E:K,MATCH(BS!G10,Questions!F:F,0),4)","v":"Able to navigate online content and locate the information they need"},{"$f":"INDEX(Questions!E:K,MATCH(BS!G10,Questions!F:F,0),5)","v":"Ability to use the internet"},{"$f":"INDEX(Questions!E:K,MATCH(BS!G10,Questions!F:F,0),7)","v":"How would you rate your ability to use the\nInternet?\n1. Excellent\n2. Good\n3. Fair\n4. Poor\n5. Bad\n6. Don’t know"},{"$f":"INDEX(Questions!E:K,MATCH(BS!G10,Questions!F:F,0),1)","v":"N"},133]
[null,{"$f":"INDEX(Questions!E:K,MATCH(BS!G11,Questions!F:F,0),3)","v":"Basic skills:Digital literacy"},{"$f":"INDEX(Questions!E:K,MATCH(BS!G11,Questions!F:F,0),4)","v":"Able to navigate online content and locate the information they need"},{"$f":"INDEX(Questions!E:K,MATCH(BS!G11,Questions!F:F,0),5)","v":"Ability to find information online\n\n"},{"$f":"INDEX(Questions!E:K,MATCH(BS!G11,Questions!F:F,0),7)","v":"To what extent do you agree or disagree with the following statements?\n\n- When I need information the first place I look is the internet\n - I find it easy to find what I am looking for online\n - I would rather look at information in a paper leaflet than on a company’s website\n\n1. Strongly Agree\n2. Tend to Agree\n3. Tend to disagree\n4. Strongly  disagree\n5. Don’t know\n6. Does not apply to me\n "},{"$f":"INDEX(Questions!E:K,MATCH(BS!G11,Questions!F:F,0),1)","v":"N"},134]
[null,{"$f":"INDEX(Questions!E:K,MATCH(BS!G12,Questions!F:F,0),3)","v":"Basic skills: Communication"},{"$f":"INDEX(Questions!E:K,MATCH(BS!G12,Questions!F:F,0),4)","v":"Able to confidently interact with others in English (or Welsh in Wales)"},{"$f":"INDEX(Questions!E:K,MATCH(BS!G12,Questions!F:F,0),5)","v":"Ease of communicating in English or (Welsh in Wales)  "},{"$f":"INDEX(Questions!E:K,MATCH(BS!G12,Questions!F:F,0),7)","v":"Can I check, is English your first language?  Yes/No\n\n[IF NO]  So can I check would you have any difficulty speaking in English to a member of staff in a bank about choosing a financial product?\n1. Yes\n2. No\n\nIF IN WALES: \nCan I check, is English or Welsh your first language?  \nYes - English\nYes - Welsh\nNo, neither\n\n[IF NEITHER]  So can I check would you have any difficulty speaking in English or Welsh to a member of staff in a bank about choosing a financial product?\n1. Yes\n2. No"},{"$f":"INDEX(Questions!E:K,MATCH(BS!G12,Questions!F:F,0),1)","v":"N"},135]

{"sheet":"ATFP","index":27,"n_rows":9,"n_cols":7,"rows_kept":9,"cut":false,"hidden":false,"merged":[[6,6,6,7]]}
[]
[null,null,"Adult Outcome Frameworks"]
[]
[null,"Connection - Access to financial products"]
[null,"Select the questions that are relevant to your intervention -  use the first question for each indicator, "]
[null,"only use additional questions if that indicator is particularly important."]
[null,"Higher level outcome","Lower level outcome","Indicator","Question","Building Block Y/N","Question"]
[null,{"$f":"INDEX(Questions!E:K,MATCH(ATFP!G8,Questions!F:F,0),3)","v":"Exposure and access to financial products "},{"$f":"INDEX(Questions!E:K,MATCH(ATFP!G8,Questions!F:F,0),4)","v":"Access to appropriate financial products which meet their needs via appropriate channels"},{"$f":"INDEX(Questions!E:K,MATCH(ATFP!G8,Questions!F:F,0),5)","v":"Ease of access to banking services, either in person or my mail"},{"$f":"INDEX(Questions!E:K,MATCH(ATFP!G8,Questions!F:F,0),7)","v":"How easy or difficult is it for you to do each of the folllowing things?\nCHOOSE ONE ONLY FOR EACH\n- Get to a Post Office using your normal forms of transport\n- Get to a Cash point using your normal forms of transport\n- Get to a Bank, building society or credit union using your normal forms of transport\n- Receive confidential financial documents by post, such as a payment card or chequebook\n\n1.Very easy\n2.Quite easy\n3.Quite difficult\n4.Very difficult\n5.Unable to go\n6.Do not wish to go"},{"$f":"INDEX(Questions!E:K,MATCH(ATFP!G8,Questions!F:F,0),1)","v":"N"},65]
[null,{"$f":"INDEX(Questions!E:K,MATCH(ATFP!G9,Questions!F:F,0),3)","v":"Exposure and access to financial products "},{"$f":"INDEX(Questions!E:K,MATCH(ATFP!G9,Questions!F:F,0),4)","v":"Access to appropriate financial products which meet their needs via appropriate channels"},{"$f":"INDEX(Questions!E:K,MATCH(ATFP!G9,Questions!F:F,0),5)","v":"Types of banking products held"},{"$f":"INDEX(Questions!E:K,MATCH(ATFP!G9,Questions!F:F,0),7)","v":"Which of the following types of everyday accounts do you have, if any, either in your own name or jointly with someone else? These might be held with a bank, building society or other provider such as a credit union or post office. \nCHOOSE ALL THAT APPLY\n1. Current account (usually offered with an overdraft facility, even if you don't want one)\n2. Basic Bank Account (normally without an overdraft facility)\n3. Post Office Card Account (for receiving your pension, benefits or tax credits) \n4. A saving deposit account (e.g. an instant access or notice account, including cash ISA)\n5. None of these"},{"$f":"INDEX(Questions!E:K,MATCH(ATFP!G9,Questions!F:F,0),1)","v":"N"},66]

{"sheet":"MEANS","index":28,"n_rows":16,"n_cols":7,"rows_kept":16,"cut":false,"hidden":false,"merged":[[6,6,6,7]]}
[]
[null,null,"Adult Outcome Frameworks"]
[]
[null,"Means: Income, savings, access to affordable credit"]
[null,"Select the questions that are relevant to your intervention -  use the first question for each indicator, "]
[null,"only use additional questions if that indicator is particularly important."]
[null,"Higher level outcome","Lower level outcome","Indicator","Question","Building Block Y/N","Question"]
[null,{"$f":"INDEX(Questions!E:K,MATCH(MEANS!G8,Questions!F:F,0),3)","v":"Income"},{"$f":"INDEX(Questions!E:K,MATCH(MEANS!G8,Questions!F:F,0),4)","v":"Employment status"},{"$f":"INDEX(Questions!E:K,MATCH(MEANS!G8,Questions!F:F,0),5)","v":"N/A"},{"$f":"INDEX(Questions!E:K,MATCH(MEANS!G8,Questions!F:F,0),7)","v":"Thinking about your employment, what is your current status?\n\nSELECT ONE ONLY\nIF MORE THAN ONE APPLIES, SELECT MAIN STATUS\nIF ON MATERNITY LEAVE FROM EMPLOYER AND PLANNING ON RETURNING COUNT THIS AS WORKING\n1. Working for an employer full-time (that is for 30 or more hours per week)\n2. Working for an employer part-time (that is for less than 30 hours per week)\n3. Self-employed (with or without workers)\n4. Unemployed and looking for work\n5. Unemployed and not looking for work\n6. Retired\n7. Student\n8. Permanently sick / disabled\n9. Temporarily sick \n10. Looking after home\n11. Other \n"},{"$f":"INDEX(Questions!E:K,MATCH(MEANS!G8,Questions!F:F,0),1)","v":"N"},136]
[null,{"$f":"INDEX(Questions!E:K,MATCH(MEANS!G9,Questions!F:F,0),3)","v":"Income"},{"$f":"INDEX(Questions!E:K,MATCH(MEANS!G9,Questions!F:F,0),4)","v":"Income "},{"$f":"INDEX(Questions!E:K,MATCH(MEANS!G9,Questions!F:F,0),5)","v":"N/A"},{"$f":"INDEX(Questions!E:K,MATCH(MEANS!G9,Questions!F:F,0),7)","v":"A) Which of the following sources of income, if any, do you currently have? Please include any income you receive personally or jointly with your partner or spouse. \nCHOOSE ALL THAT APPLY  \n1. Income from employment/self-employment (including sick pay)\n2. Income from personal or occupational pensions\n3. Income from savings/investments\n4. Rent you receive from boarders or lodgers (not family members) or other property you rent out or sublet\n5. Child maintenance payments\n6. Other types of payments or maintenance from parents or other family members who you do not live with, including as regular gifts\n7. None of these (SINGLE CODE ONLY)\n8. Don’t know  (SINGLE CODE ONLY)\n9. Prefer not to say  (SINGLE CODE ONLY)\n\nB) And which of the following sources of income do you currently have, if any?\nCHOOSE ALL THAT APPLY  \n1. State Pension\n2. Pension Credit\n3. Child benefit\n4. Universal Credit\n5. Working Tax Credits\n6. Job Seekers Allowance (JSA) \n7. Employment and Support Allowance (ESA)\n8. Income Support \n9. Housing benefit\n10. Council Tax Reduction\n11. Disability Living Allowance (DLA), Personal Independence Payment (PIP) or Attendance Allowance (AA)\n12. Carers Allowance\n13. Something else \n14. None of these (SINGLE CODE ONLY)\n15. Don't know (SINGLE CODE ONLY)\n16. Prefer not to say (SINGLE CODE ONLY)"},{"$f":"INDEX(Questions!E:K,MATCH(MEANS!G9,Questions!F:F,0),1)","v":"N"},137]
[null,{"$f":"INDEX(Questions!E:K,MATCH(MEANS!G10,Questions!F:F,0),3)","v":"Income"},{"$f":"INDEX(Questions!E:K,MATCH(MEANS!G10,Questions!F:F,0),4)","v":"Income "},{"$f":"INDEX(Questions!E:K,MATCH(MEANS!G10,Questions!F:F,0),5)","v":"N/A"},{"$f":"INDEX(Questions!E:K,MATCH(MEANS!G10,Questions!F:F,0),7)","v":"Which band from the grid below does your household’s total gross income from all sources fall into?\n[INCOME is any money from work, including a second job or occasional work, and any other sources, such as benefits, pensions, savings and investments, maintenance payments and rent from property or subletting.]\nGROSS means the amount you receive before any deductions, income tax, National Insurance etc. \nCHOOSE ONE ONLY\n Per Week Per Month Per Year\n1. Up to £86 Up to £374 Under £4,500\n2. £87 - £124 £375 - £541 £4,500 - £6,499\n3.  £125 - £143 £542 - £624 £6,500 - £7,499\n4.  £144 - £182 £625 - £791 £7,500 - £9,499\n5. £183 - £220 £792 - £957 £9,500 - £11,499\n6. £221 - £259 £958 - £1,124 £11,500 - £13,499\n7.  £260 - £297 £1,125 - £1,291 £13,500 - £15,499\n8.  £298 - £336 £1,292 - £1,457 £15,500 - £17,499\n9.  £337 - £384 £1,458 - £1,666 £17,500 - £19,999\n10.  £385 - £480 £1,667 - £2,082 £20,000 - £24,999\n11. £481 - £576 £2,083 - £2,499 £25,000 - £29,999\n12. £577 - £672 £2,500 - £2,916 £30,000 - £34,999\n13. £673 - £768 £2,917 - £3,332 £35,000 - £39,999\n14. £769 - £961 £3,333 - £4,166 £40,000 - £49,999\n15 £962 - £1,441 £4,167 - £6,249 £50,000 - £74,999\n16.  £1,442 - £1,922 £6,250 - £8,332 £75,000 - £99,999\n17. £1,923+ £8,333+ £100,000+\n18. Don’t know\n19. Prefer not to say "},{"$f":"INDEX(Questions!E:K,MATCH(MEANS!G10,Questions!F:F,0),1)","v":"N"},138]
[null,{"$f":"INDEX(Questions!E:K,MATCH(MEANS!G11,Questions!F:F,0),3)","v":"Income"},{"$f":"INDEX(Questions!E:K,MATCH(MEANS!G11,Questions!F:F,0),4)","v":"Income "},{"$f":"INDEX(Questions!E:K,MATCH(MEANS!G11,Questions!F:F,0),5)","v":"N/A"},{"$f":"INDEX(Questions!E:K,MATCH(MEANS!G11,Questions!F:F,0),7)","v":"POST\nBy how much has your income increased since [REFERENCE POINT]?\n1. ENTER AMOUNT IN £\n2. Stayed the same\n3. Has fallen\n4. Don't know\n5. Prefer not to say"},{"$f":"INDEX(Questions!E:K,MATCH(MEANS!G11,Questions!F:F,0),1)","v":"N"},139]
[null,{"$f":"INDEX(Questions!E:K,MATCH(MEANS!G12,Questions!F:F,0),3)","v":"Income"},{"$f":"INDEX(Questions!E:K,MATCH(MEANS!G12,Questions!F:F,0),4)","v":"Income "},{"$f":"INDEX(Questions!E:K,MATCH(MEANS!G12,Questions!F:F,0),5)","v":"N/A"},{"$f":"INDEX(Questions!E:K,MATCH(MEANS!G12,Questions!F:F,0),7)","v":"Which one of these best applies to you personally?\n1. Pay income tax at a basic rate\n2. Pay income tax at a higher rate\n3. Do not pay income tax\n4. Don’t know\n5. Prefer not to say"},{"$f":"INDEX(Questions!E:K,MATCH(MEANS!G12,Questions!F:F,0),1)","v":"N"},140]
[null,{"$f":"INDEX(Questions!E:K,MATCH(MEANS!G13,Questions!F:F,0),3)","v":"Savings"},{"$f":"INDEX(Questions!E:K,MATCH(MEANS!G13,Questions!F:F,0),4)","v":"Savings"},{"$f":"INDEX(Questions!E:K,MATCH(MEANS!G13,Questions!F:F,0),5)","v":"N/A"},{"$f":"INDEX(Questions!E:K,MATCH(MEANS!G13,Questions!F:F,0),7)","v":"Please can you tell me whether you currently have money saved in any of the following types of savings accounts and investments, including any joint accounts? CHOOSE ALL THAT APPLY\n1. A savings or deposit account with a bank or building society\n2. An account with a Credit Union\n3. Cash ISA\n4. Premium bonds\n5. Stocks and shares\n6. Other savings products\n7. Other investment product (not including pension)\n8. None of these (SINGLE CODE ONLY)\n9. Don't know (SINGLE CODE ONLY)\n10. Prefer not to say (SINGLE CODE ONLY)"},{"$f":"INDEX(Questions!E:K,MATCH(MEANS!G13,Questions!F:F,0),1)","v":"N"},141]
[null,{"$f":"INDEX(Questions!E:K,MATCH(MEANS!G14,Questions!F:F,0),3)","v":"Other assets"},{"$f":"INDEX(Questions!E:K,MATCH(MEANS!G14,Questions!F:F,0),4)","v":"Other assets "},{"$f":"INDEX(Questions!E:K,MATCH(MEANS!G14,Questions!F:F,0),5)","v":"N/A"},{"$f":"INDEX(Questions!E:K,MATCH(MEANS!G14,Questions!F:F,0),7)","v":"A) Which, if any, of these assets do you have, not including your own home? Please include any in your sole name or jointly owned with someone else\nCHOOSE ALL THAT APPLY. \n1. Houses, flats or holiday homes, including timeshares (not including this home) \n2. Farm or Business Property (such as a shop, warehouse or garage) \n3. Other land \n4. Cars, motorbikes, boats and other motor vehicles\n5. Money owed to you by others \n6. Money held in a trust \n7. Art, antiques, collectables, jewellery, and other valuables\n8. Other assets\n9. None of these (SINGLE CODE ONLY)\n10. Don't know (SINGLE CODE ONLY)\n11. Prefer not to say (SINGLE CODE ONLY)\n\nB) How much, in total, do you think they are currently worth? We only need your best estimate if you are unsure. \nCHOOSE ONE ONLY\n1. Less than £30,000 \n2. £30,000 to £39,999\n3. £40,000 to £49,999\n4. £50,000 to £74,999\n5. £75,000 to £99,999\n6. £100,000 to £149,999\n7. £150,000 to £199,999\n8. £200,000 to £249,999\n9. £250,000 to £500,000\n10. £500,000+\n11. Don't know (SINGLE CODE ONLY)\n12. Prefer not to say (SINGLE CODE ONLY)"},{"$f":"INDEX(Questions!E:K,MATCH(MEANS!G14,Questions!F:F,0),1)","v":"N"},142]
[null,{"$f":"INDEX(Questions!E:K,MATCH(MEANS!G15,Questions!F:F,0),3)","v":"Other assets"},{"$f":"INDEX(Questions!E:K,MATCH(MEANS!G15,Questions!F:F,0),4)","v":"Other assets "},{"$f":"INDEX(Questions!E:K,MATCH(MEANS!G15,Questions!F:F,0),5)","v":"N/A"},{"$f":"INDEX(Questions!E:K,MATCH(MEANS!G15,Questions!F:F,0),7)","v":"A) In which of these ways do you (and your household) occupy your home?\n1. Own it outright\n2. Buying it with the help of a mortgage or loan\n3. Pay part rent and part mortgage (shared ownership)\n4. Rent it\n5. Live here rent-free (including rent-free in relative's/friend's property; excluding\nsquatting)\n6. Squatting\n\nB) And how much in total is left to pay on your mortgage (or mortgages, if you have more than one). If you are unsure, please give your best estimate.\nCHOOSE ONE ONLY\n1. Less than £10,000\n2. £10,000 to £19,999\n3. £20,000 to £29,999\n4. £30,000 to £39,999\n5. £40,000 to £49,999\n6. £50,000 to £74,999\n7. £75,000 to £99,999\n8. £100,000\n9. to £149,999\n10. £150,000 to £199,999\n11. £200,000 to £249,999\n12. £250,000 to £299,999\n13. £300,000 to £399,999\n14. £400,000 to £499,999\n15. £500,000 or more\n16. Don't know\n17. Prefer not to say\n\nC) About how much would you expect to get (in total and not just your share) for your current home if you sold it today (before paying off any outstanding mortgage or loan on the property)?\nCHOOSE ONE ONLY\nENTER AMOUNT IN £s  If DK, then asked banded question: \n1. Less than £60,000\n2. £60,000 to £99,999\n3. £100,000 to £149.999\n4. £150,000 to £199,999\n5. £200,000 to £249,999\n6. £250,000 to £299,999\n7. £300,000 to £349,999\n8. £350,000 to £399,999\n9. £400,000 to £499,999\n10. £500,000 to £749,999\n11. £750,000 to £999,999\n12. £1 million or more "},{"$f":"INDEX(Questions!E:K,MATCH(MEANS!G15,Questions!F:F,0),1)","v":"N"},143]
[null,{"$f":"INDEX(Questions!E:K,MATCH(MEANS!G16,Questions!F:F,0),3)","v":"Access to affordable credit "},{"$f":"INDEX(Questions!E:K,MATCH(MEANS!G16,Questions!F:F,0),4)","v":"Access to affordable credit "},{"$f":"INDEX(Questions!E:K,MATCH(MEANS!G16,Questions!F:F,0),5)","v":"N/A"},{"$f":"INDEX(Questions!E:K,MATCH(MEANS!G16,Questions!F:F,0),7)","v":"Please can you tell me which of the following you have had in the last [3 months], whether in your own name or jointly with someone else? Please include any that you are in arrears with.\n1. Credit or store card\n2. Overdraft \n3. Payday loan\n3. Loan from company that collects payments from your home (e.g. Provident, Greenwoods)\n5. Loan from a pawnbroker\n7. Loan from a Credit Union or other community finance organisation\n8. A loan from a friend or relative.\n9. Loan from the Social Fund\n10. Loan from an unlicensed lender who charges interest, sometimes called a loan shark\n11. Any other type of loan from a bank, building society or finance company e.g. Norton Finance, Blackhorse car finance\n11) Something else\n12) Don't know\n13) Prefer not to say"},{"$f":"INDEX(Questions!E:K,MATCH(MEANS!G16,Questions!F:F,0),1)","v":"N"},144]

{"sheet":"PRESSURE","index":29,"n_rows":10,"n_cols":7,"rows_kept":10,"cut":false,"hidden":false,"merged":[[6,6,6,7]]}
[]
[null,null,"Adult Outcome Frameworks"]
[]
[null,"Pressures: Expenditure"]
[null,"Select the questions that are relevant to your intervention -  use the first question for each indicator, "]
[null,"only use additional questions if that indicator is particularly important."]
[null,"Higher level outcome","Lower level outcome","Indicator","Question","Building Block Y/N","Question"]
[null,{"$f":"INDEX(Questions!E:K,MATCH(PRESSURE!G8,Questions!F:F,0),3)","v":"Committed expenditure"},{"$f":"INDEX(Questions!E:K,MATCH(PRESSURE!G8,Questions!F:F,0),4)","v":"Additional outgoings"},{"$f":"INDEX(Questions!E:K,MATCH(PRESSURE!G8,Questions!F:F,0),5)","v":"Number of additional high-value monthly outgoings"},{"$f":"INDEX(Questions!E:K,MATCH(PRESSURE!G8,Questions!F:F,0),7)","v":"Do you (and your partner if you have one) regularly spend more than £200 a month on any of the following items? \nCHOOSE ALL THAT APPLY \n1. Travel to work\n2. Rent paid because you work away from home and cannot claim it back\n3. Child care\n4. School fees\n5. Care for someone else (including nursing home)\n6. Financial support to a partner, child or other family member who does not live with you\n7. None of these (SINGLE CODE ONLY)\n8. Don’t know (SINGLE CODE ONLY)\n9. Prefer not to say (SINGLE CODE ONLY)"},{"$f":"INDEX(Questions!E:K,MATCH(PRESSURE!G8,Questions!F:F,0),1)","v":"N"},145]
[null,{"$f":"INDEX(Questions!E:K,MATCH(PRESSURE!G9,Questions!F:F,0),3)","v":"Committed expenditure"},{"$f":"INDEX(Questions!E:K,MATCH(PRESSURE!G9,Questions!F:F,0),4)","v":"Additional outgoings"},{"$f":"INDEX(Questions!E:K,MATCH(PRESSURE!G9,Questions!F:F,0),5)","v":"Number of additional high-value monthly outgoings that are more than budget allows for"},{"$f":"INDEX(Questions!E:K,MATCH(PRESSURE!G9,Questions!F:F,0),7)","v":"Do you (and your partner if you have one) regularly spend more than you can afford on any of the following items? \nPLEASE SELECT ALL THAT APPLY \n1. Travel to work\n2. Rent paid because you work away from home and cannot claim it back\n3. Child care\n4. School fees\n5. Care for someone else (including nursing home)\n6. Financial support to a partner, child or other family member who does not live with you\n7. Paying off credit or store cards \n8. Paying for goods bought on hire purchase or mail order\n8. None of these (SINGLE CODE ONLY)"},{"$f":"INDEX(Questions!E:K,MATCH(PRESSURE!G9,Questions!F:F,0),1)","v":"N"},146]
[null,{"$f":"INDEX(Questions!E:K,MATCH(PRESSURE!G10,Questions!F:F,0),3)","v":"Committed expenditure"},{"$f":"INDEX(Questions!E:K,MATCH(PRESSURE!G10,Questions!F:F,0),4)","v":"Dependent children"},{"$f":"INDEX(Questions!E:K,MATCH(PRESSURE!G10,Questions!F:F,0),5)","v":"Number of dependent children"},{"$f":"INDEX(Questions!E:K,MATCH(PRESSURE!G10,Questions!F:F,0),7)","v":"How many children depend on you financially?"},{"$f":"INDEX(Questions!E:K,MATCH(PRESSURE!G10,Questions!F:F,0),1)","v":"N"},147]

{"sheet":"ATAG","index":30,"n_rows":9,"n_cols":7,"rows_kept":9,"cut":false,"hidden":false,"merged":[[6,6,6,7]]}
[]
[null,null,"Adult Outcome Frameworks"]
[]
[null,"Connection - Access to advice and guidance"]
[null,"Select the questions that are relevant to your intervention -  use the first question for each indicator, "]
[null,"only use additional questions if that indicator is particularly important."]
[null,"Higher level outcome","Lower level outcome","Indicator","Question","Building Block Y/N","Question"]
[null,{"$f":"INDEX(Questions!E:K,MATCH(ATAG!G8,Questions!F:F,0),3)","v":"Exposure and access to appropriate financial advice and guidance"},{"$f":"INDEX(Questions!E:K,MATCH(ATAG!G8,Questions!F:F,0),4)","v":"Access to financial advice, guidance and tools which meet their needs in a form and language they can understand, and channel they can use effectively"},{"$f":"INDEX(Questions!E:K,MATCH(ATAG!G8,Questions!F:F,0),5)","v":"Ease of access to advice services, either in person or by telephone "},{"$f":"INDEX(Questions!E:K,MATCH(ATAG!G8,Questions!F:F,0),7)","v":"How easy or difficult is it for you to do each of the following things?\nCHOOSE ONE ONLY FOR EACH\n-Get to a Citizens Advice Bureau or other advice agency using your normal forms of transport\n-Get to a Jobcentre Plus or local benefit office using your normal forms of transport\n-Use a telephone in private to discuss financial matters\n-Receive confidential financial information by post\n\n1.Very easy\n2.Quite easy\n3.Quite difficult\n4.Very difficult\n5.Unable to go\n6.Do not wish to go"},{"$f":"INDEX(Questions!E:K,MATCH(ATAG!G8,Questions!F:F,0),1)","v":"N"},64]
[null,{"$f":"INDEX(Questions!E:K,MATCH(ATAG!G9,Questions!F:F,0),3)","v":"Exposure and access to appropriate financial advice and guidance"},{"$f":"INDEX(Questions!E:K,MATCH(ATAG!G9,Questions!F:F,0),4)","v":"Digital access to financial advice, guidance and tools "},{"$f":"INDEX(Questions!E:K,MATCH(ATAG!G9,Questions!F:F,0),5)","v":"Use of the internet to access information about money and finances "},{"$f":"INDEX(Questions!E:K,MATCH(ATAG!G9,Questions!F:F,0),7)","v":"In which of the following ways, if any, can or do you use the internet when you need to access information about money or your finances?\nCHOOSE ALL THAT APPLY\n1. At home, using a computer or laptop\n2. At home, using a mobile phone, tablet or internet-enabled TV\n3. At work, college or at a friend or relative's home\n4. In a library, community centre or other public setting\n5. Somewhere else\n6. Do not use the internet"},{"$f":"INDEX(Questions!E:K,MATCH(ATAG!G9,Questions!F:F,0),1)","v":"N"},67]

{"sheet":"Questions","index":31,"n_rows":540,"n_cols":24,"rows_kept":540,"cut":false,"hidden":false,"merged":[]}
[]
["In",null,"Sheet","Section","Building Block","No.","Higher level outcome","Lower level outcome","Indicator","Original source","Final framework question","Notes for users",null,null,null,"Question","Section","Building Block?","Higher level outcome","Lower level outcome","Indicator","Original source","Final framework question","Notes for users"]
[false,{"$f":"IF(A3=TRUE,\"In\",\"Out\")","v":"Out"},"CFW","Wellbeing","Y",1,"Current financial wellbeing","Able to live (adequately) within means","Satisfaction with financial circumstances ","FinCap B2","How satisfied are you with your overall financial circumstances? \n\nPlease answer on a scale of 0 to 10, where 0 is ‘not at all satisfied’ and 10 is ‘completely satisfied’ \n\n0 Not at all satisfied\n...\n10 Completely satisfied\nDon’t know",null,null,null,null,{"$f":"IFERROR(INDEX(F$3:F$281,SMALL(IF(B$3:B$281=\"In\",ROW(F$2:F$280)-ROW(F$2)+1),ROW(F1))),\"\")","v":""},{"$f":"IFERROR(INDEX(D$3:D$281,SMALL(IF(B$3:B$281=\"In\",ROW(D$2:D$280)-ROW(F$2)+1),ROW(F1))),\"\")","v":""},{"$f":"IFERROR(INDEX(E$3:E$281,SMALL(IF(B$3:B$281=\"In\",ROW(E$2:E$280)-ROW(E$2)+1),ROW(E1))),\"\")","v":""},{"$f":"IFERROR(INDEX(G$3:G$281,SMALL(IF(B$3:B$281=\"In\",ROW(F$2:F$280)-ROW(F$2)+1),ROW(F1))),\"\")","v":""},{"$f":"IFERROR(INDEX(H$3:H$281,SMALL(IF(B$3:B$281=\"In\",ROW(H$2:H$280)-ROW(G$2)+1),ROW(G1))),\"\")","v":""},{"$f":"IFERROR(INDEX(I$3:I$281,SMALL(IF(B$3:B$281=\"In\",ROW(I$2:I$280)-ROW(H$2)+1),ROW(H1))),\"\")","v":""},{"$f":"IFERROR(INDEX(J$3:J$281,SMALL(IF(B$3:B$281=\"In\",ROW(J$2:J$280)-ROW(I$2)+1),ROW(I1))),\"\")","v":""},{"$f":"IFERROR(INDEX(K$3:K$281,SMALL(IF(B$3:B$281=\"In\",ROW(K$2:K$280)-ROW(J$2)+1),ROW(J1))),\"\")","v":""},{"$f":"IFERROR(INDEX(L$3:L$281,SMALL(IF(B$3:B$281=\"In\",ROW(L$2:L$280)-ROW(K$2)+1),ROW(K1))),\"\")","v":""}]
[false,{"$f":"IF(A4=TRUE,\"In\",\"Out\")","v":"Out"},"CFW","Wellbeing","N",2,"Current financial wellbeing","Able to live (adequately) within means","Regularity of running out of money ","WAS ORunout","How often do you and your household run out of money before the end of the week or month or needed to use a credit card or overdraft to get by? Would you say it was …\n\n1. Always\n2. Most of the time\n3. Sometimes\n4. Hardly ever\n5. Never\n6. Don’t know",null,null,null,null,{"$f":"IFERROR(INDEX(F$3:F$281,SMALL(IF(B$3:B$281=\"In\",ROW(F$2:F$280)-ROW(F$2)+1),ROW(F2))),\"\")","v":""},{"$f":"IFERROR(INDEX(D$3:D$281,SMALL(IF(B$3:B$281=\"In\",ROW(D$2:D$280)-ROW(F$2)+1),ROW(F2))),\"\")","v":""},{"$f":"IFERROR(INDEX(E$3:E$281,SMALL(IF(B$3:B$281=\"In\",ROW(E$2:E$280)-ROW(E$2)+1),ROW(E2))),\"\")","v":""},{"$f":"IFERROR(INDEX(G$3:G$281,SMALL(IF(B$3:B$281=\"In\",ROW(F$2:F$280)-ROW(F$2)+1),ROW(F2))),\"\")","v":""},{"$f":"IFERROR(INDEX(H$3:H$281,SMALL(IF(B$3:B$281=\"In\",ROW(H$2:H$280)-ROW(G$2)+1),ROW(G2))),\"\")","v":""},{"$f":"IFERROR(INDEX(I$3:I$281,SMALL(IF(B$3:B$281=\"In\",ROW(I$2:I$280)-ROW(H$2)+1),ROW(H2))),\"\")","v":""},{"$f":"IFERROR(INDEX(J$3:J$281,SMALL(IF(B$3:B$281=\"In\",ROW(J$2:J$280)-ROW(I$2)+1),ROW(I2))),\"\")","v":""},{"$f":"IFERROR(INDEX(K$3:K$281,SMALL(IF(B$3:B$281=\"In\",ROW(K$2:K$280)-ROW(J$2)+1),ROW(J2))),\"\")","v":""},{"$f":"IFERROR(INDEX(L$3:L$281,SMALL(IF(B$3:B$281=\"In\",ROW(L$2:L$280)-ROW(K$2)+1),ROW(K2))),\"\")","v":""}]
[false,"Out","CFW","Wellbeing","Y",3,"Current financial wellbeing","Keeping up with bills and commitments","Self-reported keeping up with bills and commitments","Fincap J1","Which one of the following statements best describes how well you are keeping up with your bills and credit commitments at the moment? [Please include those you have personally or jointly with your partner/spouse]\nCHOOSE ONE ONLY\n\n1. Keeping up without any difficulties\n2. It is a struggle from time to time \n3. It is a constant struggle\n4. Falling behind with some bills or credit commitments\n5. Having real financial problems and have fallen behind with many bills or credit commitments  \n6. Don’t have any bills or credit commitments\n7. Don't know\n8. Prefer not to say",null,null,null,null,{"$f":"IFERROR(INDEX(F$3:F$281,SMALL(IF(B$3:B$281=\"In\",ROW(F$2:F$280)-ROW(F$2)+1),ROW(F3))),\"\")","v":""},{"$f":"IFERROR(INDEX(D$3:D$281,SMALL(IF(B$3:B$281=\"In\",ROW(D$2:D$280)-ROW(F$2)+1),ROW(F3))),\"\")","v":""},{"$f":"IFERROR(INDEX(E$3:E$281,SMALL(IF(B$3:B$281=\"In\",ROW(E$2:E$280)-ROW(E$2)+1),ROW(E3))),\"\")","v":""},{"$f":"IFERROR(INDEX(G$3:G$281,SMALL(IF(B$3:B$281=\"In\",ROW(F$2:F$280)-ROW(F$2)+1),ROW(F3))),\"\")","v":""},{"$f":"IFERROR(INDEX(H$3:H$281,SMALL(IF(B$3:B$281=\"In\",ROW(H$2:H$280)-ROW(G$2)+1),ROW(G3))),\"\")","v":""},{"$f":"IFERROR(INDEX(I$3:I$281,SMALL(IF(B$3:B$281=\"In\",ROW(I$2:I$280)-ROW(H$2)+1),ROW(H3))),\"\")","v":""},{"$f":"IFERROR(INDEX(J$3:J$281,SMALL(IF(B$3:B$281=\"In\",ROW(J$2:J$280)-ROW(I$2)+1),ROW(I3))),\"\")","v":""},{"$f":"IFERROR(INDEX(K$3:K$281,SMALL(IF(B$3:B$281=\"In\",ROW(K$2:K$280)-ROW(J$2)+1),ROW(J3))),\"\")","v":""},{"$f":"IFERROR(INDEX(L$3:L$281,SMALL(IF(B$3:B$281=\"In\",ROW(L$2:L$280)-ROW(K$2)+1),ROW(K3))),\"\")","v":""}]
[false,"Out","CFW","Wellbeing","Y",4,"Current financial wellbeing","Burden of bills or credit commitments","Self-reported burden of bills and commitments","FinCap c1","To what extent do you feel that keeping up with your bills and credit commitments is a burden?\n\n1. It is not a burden at all\n2. It is somewhat of a burden \n3. It is a heavy burden\n4. Don't know\n",null,null,null,null,{"$f":"IFERROR(INDEX(F$3:F$281,SMALL(IF(B$3:B$281=\"In\",ROW(F$2:F$280)-ROW(F$2)+1),ROW(F4))),\"\")","v":""},{"$f":"IFERROR(INDEX(D$3:D$281,SMALL(IF(B$3:B$281=\"In\",ROW(D$2:D$280)-ROW(F$2)+1),ROW(F4))),\"\")","v":""},{"$f":"IFERROR(INDEX(E$3:E$281,SMALL(IF(B$3:B$281=\"In\",ROW(E$2:E$280)-ROW(E$2)+1),ROW(E4))),\"\")","v":""},{"$f":"IFERROR(INDEX(G$3:G$281,SMALL(IF(B$3:B$281=\"In\",ROW(F$2:F$280)-ROW(F$2)+1),ROW(F4))),\"\")","v":""},{"$f":"IFERROR(INDEX(H$3:H$281,SMALL(IF(B$3:B$281=\"In\",ROW(H$2:H$280)-ROW(G$2)+1),ROW(G4))),\"\")","v":""},{"$f":"IFERROR(INDEX(I$3:I$281,SMALL(IF(B$3:B$281=\"In\",ROW(I$2:I$280)-ROW(H$2)+1),ROW(H4))),\"\")","v":""},{"$f":"IFERROR(INDEX(J$3:J$281,SMALL(IF(B$3:B$281=\"In\",ROW(J$2:J$280)-ROW(I$2)+1),ROW(I4))),\"\")","v":""},{"$f":"IFERROR(INDEX(K$3:K$281,SMALL(IF(B$3:B$281=\"In\",ROW(K$2:K$280)-ROW(J$2)+1),ROW(J4))),\"\")","v":""},{"$f":"IFERROR(INDEX(L$3:L$281,SMALL(IF(B$3:B$281=\"In\",ROW(L$2:L$280)-ROW(K$2)+1),ROW(K4))),\"\")","v":""}]
[false,"Out","CFW","Wellbeing","Y",5,"Current financial wellbeing","Burden of bills or credit commitments","Self-reported burden of bills and commitments","FinCap c2","In the last 6 months, have you fallen behind on, or missed, any payments for credit commitments or domestic bills for any 3 or more months? These 3 months don’t necessarily have to be consecutive months. \n\n1. Yes \n2. No \n3. Don’t know",null,null,null,null,{"$f":"IFERROR(INDEX(F$3:F$281,SMALL(IF(B$3:B$281=\"In\",ROW(F$2:F$280)-ROW(F$2)+1),ROW(F5))),\"\")","v":""},{"$f":"IFERROR(INDEX(D$3:D$281,SMALL(IF(B$3:B$281=\"In\",ROW(D$2:D$280)-ROW(F$2)+1),ROW(F5))),\"\")","v":""},{"$f":"IFERROR(INDEX(E$3:E$281,SMALL(IF(B$3:B$281=\"In\",ROW(E$2:E$280)-ROW(E$2)+1),ROW(E5))),\"\")","v":""},{"$f":"IFERROR(INDEX(G$3:G$281,SMALL(IF(B$3:B$281=\"In\",ROW(F$2:F$280)-ROW(F$2)+1),ROW(F5))),\"\")","v":""},{"$f":"IFERROR(INDEX(H$3:H$281,SMALL(IF(B$3:B$281=\"In\",ROW(H$2:H$280)-ROW(G$2)+1),ROW(G5))),\"\")","v":""},{"$f":"IFERROR(INDEX(I$3:I$281,SMALL(IF(B$3:B$281=\"In\",ROW(I$2:I$280)-ROW(H$2)+1),ROW(H5))),\"\")","v":""},{"$f":"IFERROR(INDEX(J$3:J$281,SMALL(IF(B$3:B$281=\"In\",ROW(J$2:J$280)-ROW(I$2)+1),ROW(I5))),\"\")","v":""},{"$f":"IFERROR(INDEX(K$3:K$281,SMALL(IF(B$3:B$281=\"In\",ROW(K$2:K$280)-ROW(J$2)+1),ROW(J5))),\"\")","v":""},{"$f":"IFERROR(INDEX(L$3:L$281,SMALL(IF(B$3:B$281=\"In\",ROW(L$2:L$280)-ROW(K$2)+1),ROW(K5))),\"\")","v":""}]
[false,"Out","CFW","Wellbeing","N",6,"Current financial wellbeing","Not experiencing material deprivation","Regularity of being unable to pay for essentials ","WB B3","How often do you and your household go without essential items due to a lack of money? This might include being unable to pay bills, buy food or pay for heating.\n\n1. Always\n2. Most of the time\n3. Sometimes\n4. Hardly ever\n5. Never\n6. Don’t know",null,null,null,null,{"$f":"IFERROR(INDEX(F$3:F$281,SMALL(IF(B$3:B$281=\"In\",ROW(F$2:F$280)-ROW(F$2)+1),ROW(F6))),\"\")","v":""},{"$f":"IFERROR(INDEX(D$3:D$281,SMALL(IF(B$3:B$281=\"In\",ROW(D$2:D$280)-ROW(F$2)+1),ROW(F6))),\"\")","v":""},{"$f":"IFERROR(INDEX(E$3:E$281,SMALL(IF(B$3:B$281=\"In\",ROW(E$2:E$280)-ROW(E$2)+1),ROW(E6))),\"\")","v":""},{"$f":"IFERROR(INDEX(G$3:G$281,SMALL(IF(B$3:B$281=\"In\",ROW(F$2:F$280)-ROW(F$2)+1),ROW(F6))),\"\")","v":""},{"$f":"IFERROR(INDEX(H$3:H$281,SMALL(IF(B$3:B$281=\"In\",ROW(H$2:H$280)-ROW(G$2)+1),ROW(G6))),\"\")","v":""},{"$f":"IFERROR(INDEX(I$3:I$281,SMALL(IF(B$3:B$281=\"In\",ROW(I$2:I$280)-ROW(H$2)+1),ROW(H6))),\"\")","v":""},{"$f":"IFERROR(INDEX(J$3:J$281,SMALL(IF(B$3:B$281=\"In\",ROW(J$2:J$280)-ROW(I$2)+1),ROW(I6))),\"\")","v":""},{"$f":"IFERROR(INDEX(K$3:K$281,SMALL(IF(B$3:B$281=\"In\",ROW(K$2:K$280)-ROW(J$2)+1),ROW(J6))),\"\")","v":""},{"$f":"IFERROR(INDEX(L$3:L$281,SMALL(IF(B$3:B$281=\"In\",ROW(L$2:L$280)-ROW(K$2)+1),ROW(K6))),\"\")","v":""}]
[false,"Out","CFW","Wellbeing","N",7,"Current financial wellbeing","Not experiencing material deprivation","Number of expenses considered affordable","SILC Afford","Looking at this list, can I just check whether your household could afford the following things? \nCHOOSE ALL THAT APPLY\n\n1. A week's annual holiday away from home\n2. Buying new, rather than second hand, clothes\n3. Keeping your home adequately warm in winter\n4. Having friends or family for a drink or meal once a month\n5. Going out or socialising\n6. A hobby or leisure activity\n7. Replacing a major electrical appliance (e.g. fridge)\n8. Keeping your home in a decent state of decoration\n9. None of these (SINGLE CODE ONLY)",null,null,null,null,{"$f":"IFERROR(INDEX(F$3:F$281,SMALL(IF(B$3:B$281=\"In\",ROW(F$2:F$280)-ROW(F$2)+1),ROW(F7))),\"\")","v":""},{"$f":"IFERROR(INDEX(D$3:D$281,SMALL(IF(B$3:B$281=\"In\",ROW(D$2:D$280)-ROW(F$2)+1),ROW(F7))),\"\")","v":""},{"$f":"IFERROR(INDEX(E$3:E$281,SMALL(IF(B$3:B$281=\"In\",ROW(E$2:E$280)-ROW(E$2)+1),ROW(E7))),\"\")","v":""},{"$f":"IFERROR(INDEX(G$3:G$281,SMALL(IF(B$3:B$281=\"In\",ROW(F$2:F$280)-ROW(F$2)+1),ROW(F7))),\"\")","v":""},{"$f":"IFERROR(INDEX(H$3:H$281,SMALL(IF(B$3:B$281=\"In\",ROW(H$2:H$280)-ROW(G$2)+1),ROW(G7))),\"\")","v":""},{"$f":"IFERROR(INDEX(I$3:I$281,SMALL(IF(B$3:B$281=\"In\",ROW(I$2:I$280)-ROW(H$2)+1),ROW(H7))),\"\")","v":""},{"$f":"IFERROR(INDEX(J$3:J$281,SMALL(IF(B$3:B$281=\"In\",ROW(J$2:J$280)-ROW(I$2)+1),ROW(I7))),\"\")","v":""},{"$f":"IFERROR(INDEX(K$3:K$281,SMALL(IF(B$3:B$281=\"In\",ROW(K$2:K$280)-ROW(J$2)+1),ROW(J7))),\"\")","v":""},{"$f":"IFERROR(INDEX(L$3:L$281,SMALL(IF(B$3:B$281=\"In\",ROW(L$2:L$280)-ROW(K$2)+1),ROW(K7))),\"\")","v":""}]
[false,"Out","CFW","Wellbeing","Y",8,"Current financial wellbeing","Ability to pay unexpected bills","How would pay an unexpected bill of £300","Fincap I10","Which, if any of the following would you do to pay a bill of £300?\nIf you think you would do more than one, please select the main thing you would do,that is the one you would get the most money from.\nPLEASE SELECT ONE ONLY\n\n1. pay it with my/our own money, without dipping into savings or cutting back on essentials\n2. pay it with my/our own money, without dipping into savings but I/we would have to cut back on essentials\n3. dip into savings\n4. use a form of credit (e.g. credit card, take out a loan or make use of an authorisedoverdraft facility)\n5. go overdrawn without authorisation\n6. get the money from friends or family as gift or loan\n7. sell personal/household item(s) to get the money\n8. couldn’t pay this bill\n9. Don’t know\n10. Prefer not to say",null,null,null,null,{"$f":"IFERROR(INDEX(F$3:F$281,SMALL(IF(B$3:B$281=\"In\",ROW(F$2:F$280)-ROW(F$2)+1),ROW(F8))),\"\")","v":""},{"$f":"IFERROR(INDEX(D$3:D$281,SMALL(IF(B$3:B$281=\"In\",ROW(D$2:D$280)-ROW(F$2)+1),ROW(F8))),\"\")","v":""},{"$f":"IFERROR(INDEX(E$3:E$281,SMALL(IF(B$3:B$281=\"In\",ROW(E$2:E$280)-ROW(E$2)+1),ROW(E8))),\"\")","v":""},{"$f":"IFERROR(INDEX(G$3:G$281,SMALL(IF(B$3:B$281=\"In\",ROW(F$2:F$280)-ROW(F$2)+1),ROW(F8))),\"\")","v":""},{"$f":"IFERROR(INDEX(H$3:H$281,SMALL(IF(B$3:B$281=\"In\",ROW(H$2:H$280)-ROW(G$2)+1),ROW(G8))),\"\")","v":""},{"$f":"IFERROR(INDEX(I$3:I$281,SMALL(IF(B$3:B$281=\"In\",ROW(I$2:I$280)-ROW(H$2)+1),ROW(H8))),\"\")","v":""},{"$f":"IFERROR(INDEX(J$3:J$281,SMALL(IF(B$3:B$281=\"In\",ROW(J$2:J$280)-ROW(I$2)+1),ROW(I8))),\"\")","v":""},{"$f":"IFERROR(INDEX(K$3:K$281,SMALL(IF(B$3:B$281=\"In\",ROW(K$2:K$280)-ROW(J$2)+1),ROW(J8))),\"\")","v":""},{"$f":"IFERROR(INDEX(L$3:L$281,SMALL(IF(B$3:B$281=\"In\",ROW(L$2:L$280)-ROW(K$2)+1),ROW(K8))),\"\")","v":""}]
[false,"Out","CFW","Wellbeing","Y",9,"Current financial wellbeing","Keeping up with bills or credit commitments",null,"Norway - NORB1","How often do you/your household have any money left over after you’ve paid for food and other bills?\n\n1. Very often\n2. Fairly often\n3. Sometimes\n4. Not very often\n5. Never\n6. Don’t know\n",null,null,null,null,{"$f":"IFERROR(INDEX(F$3:F$281,SMALL(IF(B$3:B$281=\"In\",ROW(F$2:F$280)-ROW(F$2)+1),ROW(F9))),\"\")","v":""},{"$f":"IFERROR(INDEX(D$3:D$281,SMALL(IF(B$3:B$281=\"In\",ROW(D$2:D$280)-ROW(F$2)+1),ROW(F9))),\"\")","v":""},{"$f":"IFERROR(INDEX(E$3:E$281,SMALL(IF(B$3:B$281=\"In\",ROW(E$2:E$280)-ROW(E$2)+1),ROW(E9))),\"\")","v":""},{"$f":"IFERROR(INDEX(G$3:G$281,SMALL(IF(B$3:B$281=\"In\",ROW(F$2:F$280)-ROW(F$2)+1),ROW(F9))),\"\")","v":""},{"$f":"IFERROR(INDEX(H$3:H$281,SMALL(IF(B$3:B$281=\"In\",ROW(H$2:H$280)-ROW(G$2)+1),ROW(G9))),\"\")","v":""},{"$f":"IFERROR(INDEX(I$3:I$281,SMALL(IF(B$3:B$281=\"In\",ROW(I$2:I$280)-ROW(H$2)+1),ROW(H9))),\"\")","v":""},{"$f":"IFERROR(INDEX(J$3:J$281,SMALL(IF(B$3:B$281=\"In\",ROW(J$2:J$280)-ROW(I$2)+1),ROW(I9))),\"\")","v":""},{"$f":"IFERROR(INDEX(K$3:K$281,SMALL(IF(B$3:B$281=\"In\",ROW(K$2:K$280)-ROW(J$2)+1),ROW(J9))),\"\")","v":""},{"$f":"IFERROR(INDEX(L$3:L$281,SMALL(IF(B$3:B$281=\"In\",ROW(L$2:L$280)-ROW(K$2)+1),ROW(K9))),\"\")","v":""}]
[false,"Out","CFW","Wellbeing","Y",10,"Current financial wellbeing","Finances and emotional wellbeing","Thinking about finances causes anxiety","FinCap O2","To what extent do you agree or disagree with the following statement?\n\nThinking about my financial situation makes me anxious\n\n1. Strongly agree\n2. Tend to agree\n3. Neither agree nor disagree\n4. Tend to disagree\n5. Strongly disagree\n6. Don’t know",null,null,null,null,{"$f":"IFERROR(INDEX(F$3:F$281,SMALL(IF(B$3:B$281=\"In\",ROW(F$2:F$280)-ROW(F$2)+1),ROW(F10))),\"\")","v":""},{"$f":"IFERROR(INDEX(D$3:D$281,SMALL(IF(B$3:B$281=\"In\",ROW(D$2:D$280)-ROW(F$2)+1),ROW(F10))),\"\")","v":""},{"$f":"IFERROR(INDEX(E$3:E$281,SMALL(IF(B$3:B$281=\"In\",ROW(E$2:E$280)-ROW(E$2)+1),ROW(E10))),\"\")","v":""},{"$f":"IFERROR(INDEX(G$3:G$281,SMALL(IF(B$3:B$281=\"In\",ROW(F$2:F$280)-ROW(F$2)+1),ROW(F10))),\"\")","v":""},{"$f":"IFERROR(INDEX(H$3:H$281,SMALL(IF(B$3:B$281=\"In\",ROW(H$2:H$280)-ROW(G$2)+1),ROW(G10))),\"\")","v":""},{"$f":"IFERROR(INDEX(I$3:I$281,SMALL(IF(B$3:B$281=\"In\",ROW(I$2:I$280)-ROW(H$2)+1),ROW(H10))),\"\")","v":""},{"$f":"IFERROR(INDEX(J$3:J$281,SMALL(IF(B$3:B$281=\"In\",ROW(J$2:J$280)-ROW(I$2)+1),ROW(I10))),\"\")","v":""},{"$f":"IFERROR(INDEX(K$3:K$281,SMALL(IF(B$3:B$281=\"In\",ROW(K$2:K$280)-ROW(J$2)+1),ROW(J10))),\"\")","v":""},{"$f":"IFERROR(INDEX(L$3:L$281,SMALL(IF(B$3:B$281=\"In\",ROW(L$2:L$280)-ROW(K$2)+1),ROW(K10))),\"\")","v":""}]
[false,"Out","LTFS","Wellbeing","Y",11,"Longer term financial security","Able to withstand a significant financial shock ","Number of weeks the household could cover living expenses","Financial Lives","If you lost your main source of household income, how long could your household continue to cover living expenses, without having to borrow any money or ask for help from friends or family? \n\n1. Less than a week \n2. 1 week to less than 1 month \n3. 1 month to less than 3 months \n4. 3 months to less than 6 months \n5. 6 months or longer \n6. Don’t know \n7. Refused",null,null,null,null,{"$f":"IFERROR(INDEX(F$3:F$281,SMALL(IF(B$3:B$281=\"In\",ROW(F$2:F$280)-ROW(F$2)+1),ROW(F11))),\"\")","v":""},{"$f":"IFERROR(INDEX(D$3:D$281,SMALL(IF(B$3:B$281=\"In\",ROW(D$2:D$280)-ROW(F$2)+1),ROW(F11))),\"\")","v":""},{"$f":"IFERROR(INDEX(E$3:E$281,SMALL(IF(B$3:B$281=\"In\",ROW(E$2:E$280)-ROW(E$2)+1),ROW(E11))),\"\")","v":""},{"$f":"IFERROR(INDEX(G$3:G$281,SMALL(IF(B$3:B$281=\"In\",ROW(F$2:F$280)-ROW(F$2)+1),ROW(F11))),\"\")","v":""},{"$f":"IFERROR(INDEX(H$3:H$281,SMALL(IF(B$3:B$281=\"In\",ROW(H$2:H$280)-ROW(G$2)+1),ROW(G11))),\"\")","v":""},{"$f":"IFERROR(INDEX(I$3:I$281,SMALL(IF(B$3:B$281=\"In\",ROW(I$2:I$280)-ROW(H$2)+1),ROW(H11))),\"\")","v":""},{"$f":"IFERROR(INDEX(J$3:J$281,SMALL(IF(B$3:B$281=\"In\",ROW(J$2:J$280)-ROW(I$2)+1),ROW(I11))),\"\")","v":""},{"$f":"IFERROR(INDEX(K$3:K$281,SMALL(IF(B$3:B$281=\"In\",ROW(K$2:K$280)-ROW(J$2)+1),ROW(J11))),\"\")","v":""},{"$f":"IFERROR(INDEX(L$3:L$281,SMALL(IF(B$3:B$281=\"In\",ROW(L$2:L$280)-ROW(K$2)+1),ROW(K11))),\"\")","v":""}]
[false,"Out","LTFS","Wellbeing","Y",12,"Longer term financial security","Able to withstand a significant financial shock ","Biggest unexpected bill the household could pay","Fincap I9","Imagine to pay an unexpected bill within the next seven days from today. What is the biggest bill could pay, either from money you already have, or money you could easily borrow in a way that you consider affordable? If you don’t know the exact amount your best guess is fine. \n\n1. None – I couldn’t pay an unexpected bill \n2. £50 \n3. £100 \n4. £300 \n5. £500 \n6. £1,000 \n7. £2,500 \n8. £5,000 \n9. £10,000 \n10. Don’t know \n11. Prefer not to say",null,null,null,null,{"$f":"IFERROR(INDEX(F$3:F$281,SMALL(IF(B$3:B$281=\"In\",ROW(F$2:F$280)-ROW(F$2)+1),ROW(F12))),\"\")","v":""},{"$f":"IFERROR(INDEX(D$3:D$281,SMALL(IF(B$3:B$281=\"In\",ROW(D$2:D$280)-ROW(F$2)+1),ROW(F12))),\"\")","v":""},{"$f":"IFERROR(INDEX(E$3:E$281,SMALL(IF(B$3:B$281=\"In\",ROW(E$2:E$280)-ROW(E$2)+1),ROW(E12))),\"\")","v":""},{"$f":"IFERROR(INDEX(G$3:G$281,SMALL(IF(B$3:B$281=\"In\",ROW(F$2:F$280)-ROW(F$2)+1),ROW(F12))),\"\")","v":""},{"$f":"IFERROR(INDEX(H$3:H$281,SMALL(IF(B$3:B$281=\"In\",ROW(H$2:H$280)-ROW(G$2)+1),ROW(G12))),\"\")","v":""},{"$f":"IFERROR(INDEX(I$3:I$281,SMALL(IF(B$3:B$281=\"In\",ROW(I$2:I$280)-ROW(H$2)+1),ROW(H12))),\"\")","v":""},{"$f":"IFERROR(INDEX(J$3:J$281,SMALL(IF(B$3:B$281=\"In\",ROW(J$2:J$280)-ROW(I$2)+1),ROW(I12))),\"\")","v":""},{"$f":"IFERROR(INDEX(K$3:K$281,SMALL(IF(B$3:B$281=\"In\",ROW(K$2:K$280)-ROW(J$2)+1),ROW(J12))),\"\")","v":""},{"$f":"IFERROR(INDEX(L$3:L$281,SMALL(IF(B$3:B$281=\"In\",ROW(L$2:L$280)-ROW(K$2)+1),ROW(K12))),\"\")","v":""}]
[false,"Out","LTFS","Wellbeing","Y",13,"Longer term financial security","Able to withstand a significant financial shock ","Ratio of savings to income","Genworth","See means section of framework for savings and income questions",null,null,null,null,{"$f":"IFERROR(INDEX(F$3:F$281,SMALL(IF(B$3:B$281=\"In\",ROW(F$2:F$280)-ROW(F$2)+1),ROW(F13))),\"\")","v":""},{"$f":"IFERROR(INDEX(D$3:D$281,SMALL(IF(B$3:B$281=\"In\",ROW(D$2:D$280)-ROW(F$2)+1),ROW(F13))),\"\")","v":""},{"$f":"IFERROR(INDEX(E$3:E$281,SMALL(IF(B$3:B$281=\"In\",ROW(E$2:E$280)-ROW(E$2)+1),ROW(E13))),\"\")","v":""},{"$f":"IFERROR(INDEX(G$3:G$281,SMALL(IF(B$3:B$281=\"In\",ROW(F$2:F$280)-ROW(F$2)+1),ROW(F13))),\"\")","v":""},{"$f":"IFERROR(INDEX(H$3:H$281,SMALL(IF(B$3:B$281=\"In\",ROW(H$2:H$280)-ROW(G$2)+1),ROW(G13))),\"\")","v":""},{"$f":"IFERROR(INDEX(I$3:I$281,SMALL(IF(B$3:B$281=\"In\",ROW(I$2:I$280)-ROW(H$2)+1),ROW(H13))),\"\")","v":""},{"$f":"IFERROR(INDEX(J$3:J$281,SMALL(IF(B$3:B$281=\"In\",ROW(J$2:J$280)-ROW(I$2)+1),ROW(I13))),\"\")","v":""},{"$f":"IFERROR(INDEX(K$3:K$281,SMALL(IF(B$3:B$281=\"In\",ROW(K$2:K$280)-ROW(J$2)+1),ROW(J13))),\"\")","v":""},{"$f":"IFERROR(INDEX(L$3:L$281,SMALL(IF(B$3:B$281=\"In\",ROW(L$2:L$280)-ROW(K$2)+1),ROW(K13))),\"\")","v":""}]
[false,"Out","LTFS","Wellbeing","N",14,"Longer term financial security","Able to withstand a significant financial shock ","Number of insurance and protection products","Fincap E12\n/3","Which, if any, of the following protection products do you and your partner/spouse have, even if you didn't arrange them yourself? \nCHOOSE ALL THAT APPLY\n\n1. Insurance for specific items (e.g. white goods, mobile phone)\n2. Payment protection insurance (e.g. for a credit card or mortgage)\n3. Private Medical Insurance (paying or part-paying private hospital or specialist health care)\n4. Critical illness Insurance (paying a lump sum if you become seriously ill)\n5. Income protection insurance  (providing regular payments if you cannot work due to ill health or accident)\n6. Another type of insurance\n7. Funeral plan\n8. None of these ",null,null,null,null,{"$f":"IFERROR(INDEX(F$3:F$281,SMALL(IF(B$3:B$281=\"In\",ROW(F$2:F$280)-ROW(F$2)+1),ROW(F14))),\"\")","v":""},{"$f":"IFERROR(INDEX(D$3:D$281,SMALL(IF(B$3:B$281=\"In\",ROW(D$2:D$280)-ROW(F$2)+1),ROW(F14))),\"\")","v":""},{"$f":"IFERROR(INDEX(E$3:E$281,SMALL(IF(B$3:B$281=\"In\",ROW(E$2:E$280)-ROW(E$2)+1),ROW(E14))),\"\")","v":""},{"$f":"IFERROR(INDEX(G$3:G$281,SMALL(IF(B$3:B$281=\"In\",ROW(F$2:F$280)-ROW(F$2)+1),ROW(F14))),\"\")","v":""},{"$f":"IFERROR(INDEX(H$3:H$281,SMALL(IF(B$3:B$281=\"In\",ROW(H$2:H$280)-ROW(G$2)+1),ROW(G14))),\"\")","v":""},{"$f":"IFERROR(INDEX(I$3:I$281,SMALL(IF(B$3:B$281=\"In\",ROW(I$2:I$280)-ROW(H$2)+1),ROW(H14))),\"\")","v":""},{"$f":"IFERROR(INDEX(J$3:J$281,SMALL(IF(B$3:B$281=\"In\",ROW(J$2:J$280)-ROW(I$2)+1),ROW(I14))),\"\")","v":""},{"$f":"IFERROR(INDEX(K$3:K$281,SMALL(IF(B$3:B$281=\"In\",ROW(K$2:K$280)-ROW(J$2)+1),ROW(J14))),\"\")","v":""},{"$f":"IFERROR(INDEX(L$3:L$281,SMALL(IF(B$3:B$281=\"In\",ROW(L$2:L$280)-ROW(K$2)+1),ROW(K14))),\"\")","v":""}]
[false,"Out","LTFS","Wellbeing","Y",15,"Longer term financial security","Able to withstand a significant financial shock ","Number of longer-term savings products held ","FinCap G1","Do you currently have savings or investments in any of the following? Please do not include any money that you have saved in a pension. \n\n1. In a savings account \n2. In an ISA\n3. In a cash / money box\n4. In a credit union account\n5. In a savings club (e.g. Christmas savings club)\n6. Premium bonds\n7. In a current account\n8. In investments/stocks & shares\n9. Other (please specify) \n10. I do not have any savings (SINGLE CODE ONLY)\n11. Prefer not to say (SINGLE CODE ONLY)",null,null,null,null,{"$f":"IFERROR(INDEX(F$3:F$281,SMALL(IF(B$3:B$281=\"In\",ROW(F$2:F$280)-ROW(F$2)+1),ROW(F15))),\"\")","v":""},{"$f":"IFERROR(INDEX(D$3:D$281,SMALL(IF(B$3:B$281=\"In\",ROW(D$2:D$280)-ROW(F$2)+1),ROW(F15))),\"\")","v":""},{"$f":"IFERROR(INDEX(E$3:E$281,SMALL(IF(B$3:B$281=\"In\",ROW(E$2:E$280)-ROW(E$2)+1),ROW(E15))),\"\")","v":""},{"$f":"IFERROR(INDEX(G$3:G$281,SMALL(IF(B$3:B$281=\"In\",ROW(F$2:F$280)-ROW(F$2)+1),ROW(F15))),\"\")","v":""},{"$f":"IFERROR(INDEX(H$3:H$281,SMALL(IF(B$3:B$281=\"In\",ROW(H$2:H$280)-ROW(G$2)+1),ROW(G15))),\"\")","v":""},{"$f":"IFERROR(INDEX(I$3:I$281,SMALL(IF(B$3:B$281=\"In\",ROW(I$2:I$280)-ROW(H$2)+1),ROW(H15))),\"\")","v":""},{"$f":"IFERROR(INDEX(J$3:J$281,SMALL(IF(B$3:B$281=\"In\",ROW(J$2:J$280)-ROW(I$2)+1),ROW(I15))),\"\")","v":""},{"$f":"IFERROR(INDEX(K$3:K$281,SMALL(IF(B$3:B$281=\"In\",ROW(K$2:K$280)-ROW(J$2)+1),ROW(J15))),\"\")","v":""},{"$f":"IFERROR(INDEX(L$3:L$281,SMALL(IF(B$3:B$281=\"In\",ROW(L$2:L$280)-ROW(K$2)+1),ROW(K15))),\"\")","v":""}]
[false,"Out","LTFS","Wellbeing","Y",16,"Longer term financial security","Whether has a will",null,"Fincap 2018 WIL1","Do you have a will? \n\n1. Yes \n2. No \n3. Don’t know \n4. Prefer not to say",null,null,null,null,{"$f":"IFERROR(INDEX(F$3:F$281,SMALL(IF(B$3:B$281=\"In\",ROW(F$2:F$280)-ROW(F$2)+1),ROW(F16))),\"\")","v":""},{"$f":"IFERROR(INDEX(D$3:D$281,SMALL(IF(B$3:B$281=\"In\",ROW(D$2:D$280)-ROW(F$2)+1),ROW(F16))),\"\")","v":""},{"$f":"IFERROR(INDEX(E$3:E$281,SMALL(IF(B$3:B$281=\"In\",ROW(E$2:E$280)-ROW(E$2)+1),ROW(E16))),\"\")","v":""},{"$f":"IFERROR(INDEX(G$3:G$281,SMALL(IF(B$3:B$281=\"In\",ROW(F$2:F$280)-ROW(F$2)+1),ROW(F16))),\"\")","v":""},{"$f":"IFERROR(INDEX(H$3:H$281,SMALL(IF(B$3:B$281=\"In\",ROW(H$2:H$280)-ROW(G$2)+1),ROW(G16))),\"\")","v":""},{"$f":"IFERROR(INDEX(I$3:I$281,SMALL(IF(B$3:B$281=\"In\",ROW(I$2:I$280)-ROW(H$2)+1),ROW(H16))),\"\")","v":""},{"$f":"IFERROR(INDEX(J$3:J$281,SMALL(IF(B$3:B$281=\"In\",ROW(J$2:J$280)-ROW(I$2)+1),ROW(I16))),\"\")","v":""},{"$f":"IFERROR(INDEX(K$3:K$281,SMALL(IF(B$3:B$281=\"In\",ROW(K$2:K$280)-ROW(J$2)+1),ROW(J16))),\"\")","v":""},{"$f":"IFERROR(INDEX(L$3:L$281,SMALL(IF(B$3:B$281=\"In\",ROW(L$2:L$280)-ROW(K$2)+1),ROW(K16))),\"\")","v":""}]
[false,"Out","LTFS","Wellbeing","Y",17,"Longer term financial security","Able to withstand a significant financial shock ","Count of home (contents or buildings) and life insurance","FinCap 2018 INS1/INS3","Does your household have….?\nPLEASE SELECT ALL THAT APPLY \n\n1. Home insurance - buildings (Cover for the building you live in)\n2. Home insurance - contents (Cover for the contents of your home)\n3. Life insurance (A life insurance policy which might be for a limited period (often sold alongside a mortgage) or for the whole of your life)\n4. Death in service (A benefit from your employer that would pay out in the event of your death)",null,null,null,null,{"$f":"IFERROR(INDEX(F$3:F$281,SMALL(IF(B$3:B$281=\"In\",ROW(F$2:F$280)-ROW(F$2)+1),ROW(F17))),\"\")","v":""},{"$f":"IFERROR(INDEX(D$3:D$281,SMALL(IF(B$3:B$281=\"In\",ROW(D$2:D$280)-ROW(F$2)+1),ROW(F17))),\"\")","v":""},{"$f":"IFERROR(INDEX(E$3:E$281,SMALL(IF(B$3:B$281=\"In\",ROW(E$2:E$280)-ROW(E$2)+1),ROW(E17))),\"\")","v":""},{"$f":"IFERROR(INDEX(G$3:G$281,SMALL(IF(B$3:B$281=\"In\",ROW(F$2:F$280)-ROW(F$2)+1),ROW(F17))),\"\")","v":""},{"$f":"IFERROR(INDEX(H$3:H$281,SMALL(IF(B$3:B$281=\"In\",ROW(H$2:H$280)-ROW(G$2)+1),ROW(G17))),\"\")","v":""},{"$f":"IFERROR(INDEX(I$3:I$281,SMALL(IF(B$3:B$281=\"In\",ROW(I$2:I$280)-ROW(H$2)+1),ROW(H17))),\"\")","v":""},{"$f":"IFERROR(INDEX(J$3:J$281,SMALL(IF(B$3:B$281=\"In\",ROW(J$2:J$280)-ROW(I$2)+1),ROW(I17))),\"\")","v":""},{"$f":"IFERROR(INDEX(K$3:K$281,SMALL(IF(B$3:B$281=\"In\",ROW(K$2:K$280)-ROW(J$2)+1),ROW(J17))),\"\")","v":""},{"$f":"IFERROR(INDEX(L$3:L$281,SMALL(IF(B$3:B$281=\"In\",ROW(L$2:L$280)-ROW(K$2)+1),ROW(K17))),\"\")","v":""}]
[null,null,null,null,"Y",18,"Longer term financial security","Savings to income ratio (respondent and partner), banded","N/A","Fincap G5","A) Approximately how much, if anything, do you personally have in savings and investments? Please do not include any money that you have saved in a pension. \n1. ENTER EXACT AMOUNT\n2. I do not have any savings and investments\n3. Don’t know \n4. Prefer not to say \n\nB) Could you estimate the total within the following bands?\nCHOOSE ONE ONLY\n1. £100 or less\n2. £101 - £500\n3. £501 - £1,000\n4. £1,001 - £9,999\n5. £10,000 - £19,999\n6. £20,000 or more\n7. Don’t know\n8. Prefer not to say ",null,null,null,null,{"$f":"IFERROR(INDEX(F$3:F$281,SMALL(IF(B$3:B$281=\"In\",ROW(F$2:F$280)-ROW(F$2)+1),ROW(F18))),\"\")","v":""},{"$f":"IFERROR(INDEX(D$3:D$281,SMALL(IF(B$3:B$281=\"In\",ROW(D$2:D$280)-ROW(F$2)+1),ROW(F18))),\"\")","v":""},{"$f":"IFERROR(INDEX(E$3:E$281,SMALL(IF(B$3:B$281=\"In\",ROW(E$2:E$280)-ROW(E$2)+1),ROW(E18))),\"\")","v":""},{"$f":"IFERROR(INDEX(G$3:G$281,SMALL(IF(B$3:B$281=\"In\",ROW(F$2:F$280)-ROW(F$2)+1),ROW(F18))),\"\")","v":""},{"$f":"IFERROR(INDEX(H$3:H$281,SMALL(IF(B$3:B$281=\"In\",ROW(H$2:H$280)-ROW(G$2)+1),ROW(G18))),\"\")","v":""},{"$f":"IFERROR(INDEX(I$3:I$281,SMALL(IF(B$3:B$281=\"In\",ROW(I$2:I$280)-ROW(H$2)+1),ROW(H18))),\"\")","v":""},{"$f":"IFERROR(INDEX(J$3:J$281,SMALL(IF(B$3:B$281=\"In\",ROW(J$2:J$280)-ROW(I$2)+1),ROW(I18))),\"\")","v":""},{"$f":"IFERROR(INDEX(K$3:K$281,SMALL(IF(B$3:B$281=\"In\",ROW(K$2:K$280)-ROW(J$2)+1),ROW(J18))),\"\")","v":""},{"$f":"IFERROR(INDEX(L$3:L$281,SMALL(IF(B$3:B$281=\"In\",ROW(L$2:L$280)-ROW(K$2)+1),ROW(K18))),\"\")","v":""}]
[null,null,null,null,"Y",19,"Longer term financial security","Savings to income ratio (respondent and partner), banded",null,"Fincap g6","Approximately how much, if anything, do you and your partner/spouse currently have in savings and investments in total? All of your answers are confidential. \n\nPlease do not include any money that you have saved in a pension. If you don’t know the exact amount your best guess is fine. \n\n1. Less than £100 \n2. £100-£249 \n3. £250 - £499 \n4. £500 - £999 \n5. £1,000-£2,999 \n6. £3,000-£4,999 \n7. £5,000-£6,999 \n8. £7,000-£9,999 \n9. £10,000-£14,999 \n10. £15,000-£19,999 \n11. £20,000-£29,999 \n12. £30,000-£49,999 \n13. £50,000 or more \n14. We do not have any savings and investments \n14 15. Don’t know  \n16. Prefer not to say ",null,null,null,null,{"$f":"IFERROR(INDEX(F$3:F$281,SMALL(IF(B$3:B$281=\"In\",ROW(F$2:F$280)-ROW(F$2)+1),ROW(F19))),\"\")","v":""},{"$f":"IFERROR(INDEX(D$3:D$281,SMALL(IF(B$3:B$281=\"In\",ROW(D$2:D$280)-ROW(F$2)+1),ROW(F19))),\"\")","v":""},{"$f":"IFERROR(INDEX(E$3:E$281,SMALL(IF(B$3:B$281=\"In\",ROW(E$2:E$280)-ROW(E$2)+1),ROW(E19))),\"\")","v":""},{"$f":"IFERROR(INDEX(G$3:G$281,SMALL(IF(B$3:B$281=\"In\",ROW(F$2:F$280)-ROW(F$2)+1),ROW(F19))),\"\")","v":""},{"$f":"IFERROR(INDEX(H$3:H$281,SMALL(IF(B$3:B$281=\"In\",ROW(H$2:H$280)-ROW(G$2)+1),ROW(G19))),\"\")","v":""},{"$f":"IFERROR(INDEX(I$3:I$281,SMALL(IF(B$3:B$281=\"In\",ROW(I$2:I$280)-ROW(H$2)+1),ROW(H19))),\"\")","v":""},{"$f":"IFERROR(INDEX(J$3:J$281,SMALL(IF(B$3:B$281=\"In\",ROW(J$2:J$280)-ROW(I$2)+1),ROW(I19))),\"\")","v":""},{"$f":"IFERROR(INDEX(K$3:K$281,SMALL(IF(B$3:B$281=\"In\",ROW(K$2:K$280)-ROW(J$2)+1),ROW(J19))),\"\")","v":""},{"$f":"IFERROR(INDEX(L$3:L$281,SMALL(IF(B$3:B$281=\"In\",ROW(L$2:L$280)-ROW(K$2)+1),ROW(K19))),\"\")","v":""}]
[null,null,null,null,"Y",20,"Longer term financial security","Savings to income ratio (respondent and partner), banded",null,"Fincap p1","Grid - not sure how this would work in OF",null,null,null,null,{"$f":"IFERROR(INDEX(F$3:F$281,SMALL(IF(B$3:B$281=\"In\",ROW(F$2:F$280)-ROW(F$2)+1),ROW(F20))),\"\")","v":""},{"$f":"IFERROR(INDEX(D$3:D$281,SMALL(IF(B$3:B$281=\"In\",ROW(D$2:D$280)-ROW(F$2)+1),ROW(F20))),\"\")","v":""},{"$f":"IFERROR(INDEX(E$3:E$281,SMALL(IF(B$3:B$281=\"In\",ROW(E$2:E$280)-ROW(E$2)+1),ROW(E20))),\"\")","v":""},{"$f":"IFERROR(INDEX(G$3:G$281,SMALL(IF(B$3:B$281=\"In\",ROW(F$2:F$280)-ROW(F$2)+1),ROW(F20))),\"\")","v":""},{"$f":"IFERROR(INDEX(H$3:H$281,SMALL(IF(B$3:B$281=\"In\",ROW(H$2:H$280)-ROW(G$2)+1),ROW(G20))),\"\")","v":""},{"$f":"IFERROR(INDEX(I$3:I$281,SMALL(IF(B$3:B$281=\"In\",ROW(I$2:I$280)-ROW(H$2)+1),ROW(H20))),\"\")","v":""},{"$f":"IFERROR(INDEX(J$3:J$281,SMALL(IF(B$3:B$281=\"In\",ROW(J$2:J$280)-ROW(I$2)+1),ROW(I20))),\"\")","v":""},{"$f":"IFERROR(INDEX(K$3:K$281,SMALL(IF(B$3:B$281=\"In\",ROW(K$2:K$280)-ROW(J$2)+1),ROW(J20))),\"\")","v":""},{"$f":"IFERROR(INDEX(L$3:L$281,SMALL(IF(B$3:B$281=\"In\",ROW(L$2:L$280)-ROW(K$2)+1),ROW(K20))),\"\")","v":""}]
[false,{"$f":"IF(A23=TRUE,\"In\",\"Out\")","v":"Out"},"CFW","Wellbeing","N",21,"Current financial wellbeing","Finances and emotional/mental wellbeing","Effect of finances on mental health ","NI L&T 2000 LoseJob and DAE Q28","A) To what extent, if at all, do you worry about your current financial situation?\nCHOOSE ONE ONLY\n\n1. Worry a great deal\n2. Worry to some extent \n3. Worry a little \n4. Don’t worry at all \n5. Don’t know\n\nB) And which of these do you experience because of your or your household's financial situation?\n\n1. Stress or anxiety\n2. Low mood or depression\n3. Self-harm or suicidal thoughts\n4. Difficulty concentrating or relaxing\n5. Difficulty sleeping\n6. Panic attacks\n7. Family tension or arguments\n8. Domestic abuse or violence\n9. Poor/loss of appetite or eating too much\n10. Increased use of alcohol \n11. Misuse of prescription or over-the-counter drugs\n12. Use of illicit (illegal) drugs or legal highs\n13. Other (specify) \n14. Not experienced any of these\n15. Prefer not to say\n16. Don't know\n",null,null,null,null,{"$f":"IFERROR(INDEX(F$3:F$281,SMALL(IF(B$3:B$281=\"In\",ROW(F$2:F$280)-ROW(F$2)+1),ROW(F21))),\"\")","v":""},{"$f":"IFERROR(INDEX(D$3:D$281,SMALL(IF(B$3:B$281=\"In\",ROW(D$2:D$280)-ROW(F$2)+1),ROW(F21))),\"\")","v":""},{"$f":"IFERROR(INDEX(E$3:E$281,SMALL(IF(B$3:B$281=\"In\",ROW(E$2:E$280)-ROW(E$2)+1),ROW(E21))),\"\")","v":""},{"$f":"IFERROR(INDEX(G$3:G$281,SMALL(IF(B$3:B$281=\"In\",ROW(F$2:F$280)-ROW(F$2)+1),ROW(F21))),\"\")","v":""},{"$f":"IFERROR(INDEX(H$3:H$281,SMALL(IF(B$3:B$281=\"In\",ROW(H$2:H$280)-ROW(G$2)+1),ROW(G21))),\"\")","v":""},{"$f":"IFERROR(INDEX(I$3:I$281,SMALL(IF(B$3:B$281=\"In\",ROW(I$2:I$280)-ROW(H$2)+1),ROW(H21))),\"\")","v":""},{"$f":"IFERROR(INDEX(J$3:J$281,SMALL(IF(B$3:B$281=\"In\",ROW(J$2:J$280)-ROW(I$2)+1),ROW(I21))),\"\")","v":""},{"$f":"IFERROR(INDEX(K$3:K$281,SMALL(IF(B$3:B$281=\"In\",ROW(K$2:K$280)-ROW(J$2)+1),ROW(J21))),\"\")","v":""},{"$f":"IFERROR(INDEX(L$3:L$281,SMALL(IF(B$3:B$281=\"In\",ROW(L$2:L$280)-ROW(K$2)+1),ROW(K21))),\"\")","v":""}]
[false,"Out","LTFS","Wellbeing","N",22,"Longer term financial wellbeing","Confident about financial future","Level of confidence in future finances ","BASE QCstali ","Taking everything into account, how confident are you that you will have enough money to give you the standard of living you hope for in a year from now?\nCHOOSE ONE ONLY\n\n1. Very confident\n2. Fairly confident\n3. Not very confident\n4. Not at all confident\n5. Don’t know",null,null,null,null,{"$f":"IFERROR(INDEX(F$3:F$281,SMALL(IF(B$3:B$281=\"In\",ROW(F$2:F$280)-ROW(F$2)+1),ROW(F22))),\"\")","v":""},{"$f":"IFERROR(INDEX(D$3:D$281,SMALL(IF(B$3:B$281=\"In\",ROW(D$2:D$280)-ROW(F$2)+1),ROW(F22))),\"\")","v":""},{"$f":"IFERROR(INDEX(E$3:E$281,SMALL(IF(B$3:B$281=\"In\",ROW(E$2:E$280)-ROW(E$2)+1),ROW(E22))),\"\")","v":""},{"$f":"IFERROR(INDEX(G$3:G$281,SMALL(IF(B$3:B$281=\"In\",ROW(F$2:F$280)-ROW(F$2)+1),ROW(F22))),\"\")","v":""},{"$f":"IFERROR(INDEX(H$3:H$281,SMALL(IF(B$3:B$281=\"In\",ROW(H$2:H$280)-ROW(G$2)+1),ROW(G22))),\"\")","v":""},{"$f":"IFERROR(INDEX(I$3:I$281,SMALL(IF(B$3:B$281=\"In\",ROW(I$2:I$280)-ROW(H$2)+1),ROW(H22))),\"\")","v":""},{"$f":"IFERROR(INDEX(J$3:J$281,SMALL(IF(B$3:B$281=\"In\",ROW(J$2:J$280)-ROW(I$2)+1),ROW(I22))),\"\")","v":""},{"$f":"IFERROR(INDEX(K$3:K$281,SMALL(IF(B$3:B$281=\"In\",ROW(K$2:K$280)-ROW(J$2)+1),ROW(J22))),\"\")","v":""},{"$f":"IFERROR(INDEX(L$3:L$281,SMALL(IF(B$3:B$281=\"In\",ROW(L$2:L$280)-ROW(K$2)+1),ROW(K22))),\"\")","v":""}]
[false,"Out","MWDTD","Behaviours","Y",23,"Managing credit use","Reducing the value of unsecured borrowing","Total unsecured borrowing","Fincap E7","If you added up all of balances on overdrafts, credit cards, store cards, personal loans, hire purchase, car finance arrangements, approximately how much do you owe in total? Please exclude any mortgages or other loans secured on property. Please exclude any loans from the Student Loan Company. \n\nIf you don’t know the exact amount your best guess is fine. \n\n1. Nothing - I have no outstanding credit \n2. Less than £100 \n3. £100 - £499 \n4. £500 - £999 \n5. £1,000 - £4,999 \n6. £5,000 - £9,999 \n7. £10,000 - £19,999 \n8. £20,000 or more \n9. Don’t know \n10. Prefer not to say",null,null,null,null,{"$f":"IFERROR(INDEX(F$3:F$281,SMALL(IF(B$3:B$281=\"In\",ROW(F$2:F$280)-ROW(F$2)+1),ROW(F23))),\"\")","v":""},{"$f":"IFERROR(INDEX(D$3:D$281,SMALL(IF(B$3:B$281=\"In\",ROW(D$2:D$280)-ROW(F$2)+1),ROW(F23))),\"\")","v":""},{"$f":"IFERROR(INDEX(E$3:E$281,SMALL(IF(B$3:B$281=\"In\",ROW(E$2:E$280)-ROW(E$2)+1),ROW(E23))),\"\")","v":""},{"$f":"IFERROR(INDEX(G$3:G$281,SMALL(IF(B$3:B$281=\"In\",ROW(F$2:F$280)-ROW(F$2)+1),ROW(F23))),\"\")","v":""},{"$f":"IFERROR(INDEX(H$3:H$281,SMALL(IF(B$3:B$281=\"In\",ROW(H$2:H$280)-ROW(G$2)+1),ROW(G23))),\"\")","v":""},{"$f":"IFERROR(INDEX(I$3:I$281,SMALL(IF(B$3:B$281=\"In\",ROW(I$2:I$280)-ROW(H$2)+1),ROW(H23))),\"\")","v":""},{"$f":"IFERROR(INDEX(J$3:J$281,SMALL(IF(B$3:B$281=\"In\",ROW(J$2:J$280)-ROW(I$2)+1),ROW(I23))),\"\")","v":""},{"$f":"IFERROR(INDEX(K$3:K$281,SMALL(IF(B$3:B$281=\"In\",ROW(K$2:K$280)-ROW(J$2)+1),ROW(J23))),\"\")","v":""},{"$f":"IFERROR(INDEX(L$3:L$281,SMALL(IF(B$3:B$281=\"In\",ROW(L$2:L$280)-ROW(K$2)+1),ROW(K23))),\"\")","v":""}]
[false,"Out","MWDTD","Behaviours","Y",24,"Managing credit use","Planning how to pay down debt ","Quality of plan for paying down debt ","Fincap D3","How much of a plan do you have about how you will pay off or reduce my debts?\nPlease answer on a scale of 0 to 10, where 0 means you don’t have a plan of what you need to do and 10 means you have a very specific plan of what you need to do.\n\n- 0 I don’t have a plan of what I need to do\n...\n- 10 I have a very specific plan of what I need to do\n\nDon’t know\n\n",null,null,null,null,{"$f":"IFERROR(INDEX(F$3:F$281,SMALL(IF(B$3:B$281=\"In\",ROW(F$2:F$280)-ROW(F$2)+1),ROW(F24))),\"\")","v":""},{"$f":"IFERROR(INDEX(D$3:D$281,SMALL(IF(B$3:B$281=\"In\",ROW(D$2:D$280)-ROW(F$2)+1),ROW(F24))),\"\")","v":""},{"$f":"IFERROR(INDEX(E$3:E$281,SMALL(IF(B$3:B$281=\"In\",ROW(E$2:E$280)-ROW(E$2)+1),ROW(E24))),\"\")","v":""},{"$f":"IFERROR(INDEX(G$3:G$281,SMALL(IF(B$3:B$281=\"In\",ROW(F$2:F$280)-ROW(F$2)+1),ROW(F24))),\"\")","v":""},{"$f":"IFERROR(INDEX(H$3:H$281,SMALL(IF(B$3:B$281=\"In\",ROW(H$2:H$280)-ROW(G$2)+1),ROW(G24))),\"\")","v":""},{"$f":"IFERROR(INDEX(I$3:I$281,SMALL(IF(B$3:B$281=\"In\",ROW(I$2:I$280)-ROW(H$2)+1),ROW(H24))),\"\")","v":""},{"$f":"IFERROR(INDEX(J$3:J$281,SMALL(IF(B$3:B$281=\"In\",ROW(J$2:J$280)-ROW(I$2)+1),ROW(I24))),\"\")","v":""},{"$f":"IFERROR(INDEX(K$3:K$281,SMALL(IF(B$3:B$281=\"In\",ROW(K$2:K$280)-ROW(J$2)+1),ROW(J24))),\"\")","v":""},{"$f":"IFERROR(INDEX(L$3:L$281,SMALL(IF(B$3:B$281=\"In\",ROW(L$2:L$280)-ROW(K$2)+1),ROW(K24))),\"\")","v":""}]
[false,"Out","MWDTD","Behaviours","Y",25,"Managing credit use",null,"Approach to credit card repayment ","Fincap E10","How do you generally handle paying your bill each month for your credit card(s) or store card(s)? 1. Always pay only the minimum 2. Usually pay only the minimum 3. Usually pay something between the minimum and the full balance 4. Usually pay full 5. Always pay full 6. Don’t know 7. Prefer not to say",null,null,null,null,{"$f":"IFERROR(INDEX(F$3:F$281,SMALL(IF(B$3:B$281=\"In\",ROW(F$2:F$280)-ROW(F$2)+1),ROW(F25))),\"\")","v":""},{"$f":"IFERROR(INDEX(D$3:D$281,SMALL(IF(B$3:B$281=\"In\",ROW(D$2:D$280)-ROW(F$2)+1),ROW(F25))),\"\")","v":""},{"$f":"IFERROR(INDEX(E$3:E$281,SMALL(IF(B$3:B$281=\"In\",ROW(E$2:E$280)-ROW(E$2)+1),ROW(E25))),\"\")","v":""},{"$f":"IFERROR(INDEX(G$3:G$281,SMALL(IF(B$3:B$281=\"In\",ROW(F$2:F$280)-ROW(F$2)+1),ROW(F25))),\"\")","v":""},{"$f":"IFERROR(INDEX(H$3:H$281,SMALL(IF(B$3:B$281=\"In\",ROW(H$2:H$280)-ROW(G$2)+1),ROW(G25))),\"\")","v":""},{"$f":"IFERROR(INDEX(I$3:I$281,SMALL(IF(B$3:B$281=\"In\",ROW(I$2:I$280)-ROW(H$2)+1),ROW(H25))),\"\")","v":""},{"$f":"IFERROR(INDEX(J$3:J$281,SMALL(IF(B$3:B$281=\"In\",ROW(J$2:J$280)-ROW(I$2)+1),ROW(I25))),\"\")","v":""},{"$f":"IFERROR(INDEX(K$3:K$281,SMALL(IF(B$3:B$281=\"In\",ROW(K$2:K$280)-ROW(J$2)+1),ROW(J25))),\"\")","v":""},{"$f":"IFERROR(INDEX(L$3:L$281,SMALL(IF(B$3:B$281=\"In\",ROW(L$2:L$280)-ROW(K$2)+1),ROW(K25))),\"\")","v":""}]
[false,"Out","MWDTD","Behaviours","Y",26,"Managing credit use"," ","Preference for saving up rather than borrowing","Fincap O2F","I am now going to read you some things that other people have said about managing money. Please tell me how strongly you agree or disagree with them.\n - I hate to borrow – I would much rather save up in advance",null,null,null,null,{"$f":"IFERROR(INDEX(F$3:F$281,SMALL(IF(B$3:B$281=\"In\",ROW(F$2:F$280)-ROW(F$2)+1),ROW(F26))),\"\")","v":""},{"$f":"IFERROR(INDEX(D$3:D$281,SMALL(IF(B$3:B$281=\"In\",ROW(D$2:D$280)-ROW(F$2)+1),ROW(F26))),\"\")","v":""},{"$f":"IFERROR(INDEX(E$3:E$281,SMALL(IF(B$3:B$281=\"In\",ROW(E$2:E$280)-ROW(E$2)+1),ROW(E26))),\"\")","v":""},{"$f":"IFERROR(INDEX(G$3:G$281,SMALL(IF(B$3:B$281=\"In\",ROW(F$2:F$280)-ROW(F$2)+1),ROW(F26))),\"\")","v":""},{"$f":"IFERROR(INDEX(H$3:H$281,SMALL(IF(B$3:B$281=\"In\",ROW(H$2:H$280)-ROW(G$2)+1),ROW(G26))),\"\")","v":""},{"$f":"IFERROR(INDEX(I$3:I$281,SMALL(IF(B$3:B$281=\"In\",ROW(I$2:I$280)-ROW(H$2)+1),ROW(H26))),\"\")","v":""},{"$f":"IFERROR(INDEX(J$3:J$281,SMALL(IF(B$3:B$281=\"In\",ROW(J$2:J$280)-ROW(I$2)+1),ROW(I26))),\"\")","v":""},{"$f":"IFERROR(INDEX(K$3:K$281,SMALL(IF(B$3:B$281=\"In\",ROW(K$2:K$280)-ROW(J$2)+1),ROW(J26))),\"\")","v":""},{"$f":"IFERROR(INDEX(L$3:L$281,SMALL(IF(B$3:B$281=\"In\",ROW(L$2:L$280)-ROW(K$2)+1),ROW(K26))),\"\")","v":""}]
[false,"Out","MWDTD","Behaviours","N",27,"Managing credit use","Taking steps to tackle problem debt","Steps taken to tackle problem debt","Fincap J4","PRE: In the last X months, which of the following steps have you taken to reduce the amount of money you owe? This includes any debts you haven’t paid  or late/unpaid bills and credit commitments.\n\nPOST: Since [Reference Point], which of the following steps have you taken to reduce the amount of money you owe? This includes any debts you haven’t paid  or late/unpaid bills and credit commitments.\n\nCHOOSE ALL THAT APPLY\n\n1. Do not have any debts\n2. Increased regular payments\n3. Paid a lump sum towards them\n4. Spoken to the company/companies the money is owed to\n5. Taken independent advice (e.g. from Citizen's Advice Bureau, StepChange, Money Advice Service)\n6. Consolidated loans or credit cards \n7. Set up a Debt Management Plan or Debt Arrangement Scheme\n8. Arranged to write off some or all debts (e.g. applied for bankruptcy or a debt relief order, or set up an IVA)\n9. Other (specify)\n10. None of these, but have debts\n",null,null,null,null,{"$f":"IFERROR(INDEX(F$3:F$281,SMALL(IF(B$3:B$281=\"In\",ROW(F$2:F$280)-ROW(F$2)+1),ROW(F27))),\"\")","v":""},{"$f":"IFERROR(INDEX(D$3:D$281,SMALL(IF(B$3:B$281=\"In\",ROW(D$2:D$280)-ROW(F$2)+1),ROW(F27))),\"\")","v":""},{"$f":"IFERROR(INDEX(E$3:E$281,SMALL(IF(B$3:B$281=\"In\",ROW(E$2:E$280)-ROW(E$2)+1),ROW(E27))),\"\")","v":""},{"$f":"IFERROR(INDEX(G$3:G$281,SMALL(IF(B$3:B$281=\"In\",ROW(F$2:F$280)-ROW(F$2)+1),ROW(F27))),\"\")","v":""},{"$f":"IFERROR(INDEX(H$3:H$281,SMALL(IF(B$3:B$281=\"In\",ROW(H$2:H$280)-ROW(G$2)+1),ROW(G27))),\"\")","v":""},{"$f":"IFERROR(INDEX(I$3:I$281,SMALL(IF(B$3:B$281=\"In\",ROW(I$2:I$280)-ROW(H$2)+1),ROW(H27))),\"\")","v":""},{"$f":"IFERROR(INDEX(J$3:J$281,SMALL(IF(B$3:B$281=\"In\",ROW(J$2:J$280)-ROW(I$2)+1),ROW(I27))),\"\")","v":""},{"$f":"IFERROR(INDEX(K$3:K$281,SMALL(IF(B$3:B$281=\"In\",ROW(K$2:K$280)-ROW(J$2)+1),ROW(J27))),\"\")","v":""},{"$f":"IFERROR(INDEX(L$3:L$281,SMALL(IF(B$3:B$281=\"In\",ROW(L$2:L$280)-ROW(K$2)+1),ROW(K27))),\"\")","v":""}]
[false,"Out","MWDTD","Behaviours","Y",28,"Keeping track of income and spending"," ","Accuracy of knowledge about spending money","Fincap F2","Which of these best describes how accurately you know the balance on the current account that you use most often for your daily\noutgoings?\nWe’re not interested in how much money is in the account, just how accurately you\nknow how much money you have in the account. \n\nIF DON’T HAVE CURRENT ACCOUNT\nWhich of these best describes how accurately you know how much money you have at present, excluding any savings?  We’re not interested in how much money you have, just how accurately you know how much money you have to spend. \nCHOOSE ONE ONLY\n\n1. I know within a pound or two\n2. I know within £10 \n3. I know within £50\n4. I know within £100 \n5. I know within £500\n6. I have no idea at all\n\n",null,null,null,null,{"$f":"IFERROR(INDEX(F$3:F$281,SMALL(IF(B$3:B$281=\"In\",ROW(F$2:F$280)-ROW(F$2)+1),ROW(F28))),\"\")","v":""},{"$f":"IFERROR(INDEX(D$3:D$281,SMALL(IF(B$3:B$281=\"In\",ROW(D$2:D$280)-ROW(F$2)+1),ROW(F28))),\"\")","v":""},{"$f":"IFERROR(INDEX(E$3:E$281,SMALL(IF(B$3:B$281=\"In\",ROW(E$2:E$280)-ROW(E$2)+1),ROW(E28))),\"\")","v":""},{"$f":"IFERROR(INDEX(G$3:G$281,SMALL(IF(B$3:B$281=\"In\",ROW(F$2:F$280)-ROW(F$2)+1),ROW(F28))),\"\")","v":""},{"$f":"IFERROR(INDEX(H$3:H$281,SMALL(IF(B$3:B$281=\"In\",ROW(H$2:H$280)-ROW(G$2)+1),ROW(G28))),\"\")","v":""},{"$f":"IFERROR(INDEX(I$3:I$281,SMALL(IF(B$3:B$281=\"In\",ROW(I$2:I$280)-ROW(H$2)+1),ROW(H28))),\"\")","v":""},{"$f":"IFERROR(INDEX(J$3:J$281,SMALL(IF(B$3:B$281=\"In\",ROW(J$2:J$280)-ROW(I$2)+1),ROW(I28))),\"\")","v":""},{"$f":"IFERROR(INDEX(K$3:K$281,SMALL(IF(B$3:B$281=\"In\",ROW(K$2:K$280)-ROW(J$2)+1),ROW(J28))),\"\")","v":""},{"$f":"IFERROR(INDEX(L$3:L$281,SMALL(IF(B$3:B$281=\"In\",ROW(L$2:L$280)-ROW(K$2)+1),ROW(K28))),\"\")","v":""}]
[false,"Out","MWDTD","Behaviours","Y",29,"Keeping track of income and spending","Regularly checks current account","Frequency of checking current account","FinCap F5","How often do you normally check how much money is in the current account that you use most often for your daily\noutgoings? e.g. at a cash machine, by text, online banking or mobile banking app. \nPLEASE SELECT ONE ONLY \n\n1. Every day \n2. At least once a week, but not every day \n3. At least once a fortnight, but not once a week \n4. At least once a month, but not once a fortnight \n5. Less than once a month \n6. Never \n7. Don’t know",null,null,null,null,{"$f":"IFERROR(INDEX(F$3:F$281,SMALL(IF(B$3:B$281=\"In\",ROW(F$2:F$280)-ROW(F$2)+1),ROW(F29))),\"\")","v":""},{"$f":"IFERROR(INDEX(D$3:D$281,SMALL(IF(B$3:B$281=\"In\",ROW(D$2:D$280)-ROW(F$2)+1),ROW(F29))),\"\")","v":""},{"$f":"IFERROR(INDEX(E$3:E$281,SMALL(IF(B$3:B$281=\"In\",ROW(E$2:E$280)-ROW(E$2)+1),ROW(E29))),\"\")","v":""},{"$f":"IFERROR(INDEX(G$3:G$281,SMALL(IF(B$3:B$281=\"In\",ROW(F$2:F$280)-ROW(F$2)+1),ROW(F29))),\"\")","v":""},{"$f":"IFERROR(INDEX(H$3:H$281,SMALL(IF(B$3:B$281=\"In\",ROW(H$2:H$280)-ROW(G$2)+1),ROW(G29))),\"\")","v":""},{"$f":"IFERROR(INDEX(I$3:I$281,SMALL(IF(B$3:B$281=\"In\",ROW(I$2:I$280)-ROW(H$2)+1),ROW(H29))),\"\")","v":""},{"$f":"IFERROR(INDEX(J$3:J$281,SMALL(IF(B$3:B$281=\"In\",ROW(J$2:J$280)-ROW(I$2)+1),ROW(I29))),\"\")","v":""},{"$f":"IFERROR(INDEX(K$3:K$281,SMALL(IF(B$3:B$281=\"In\",ROW(K$2:K$280)-ROW(J$2)+1),ROW(J29))),\"\")","v":""},{"$f":"IFERROR(INDEX(L$3:L$281,SMALL(IF(B$3:B$281=\"In\",ROW(L$2:L$280)-ROW(K$2)+1),ROW(K29))),\"\")","v":""}]
[false,"Out","MWDTD","Behaviours","Y",30,"Keeping track of income and spending","Keeping track of income and spending","Methods used to keep track of income and expenditure","FinCap I5 ","Which, if any of these ways, do you regularly use to keep track of your income and spending? Please select all that apply. \nPLEASE SELECT ALL THAT APPLY\n\n1. Online budgeting tool \n2. Mobile banking app from your bank \n3. Budgeting or finance app on your phone \n4. Spreadsheet \n5. Piece of paper \n6. Accounts book or notebook \n7. Financial software package \n8. By checking bank balance\n9. By reviewing bank statements \n10. In head (mentally) \n11. Other (please specify) \n12. None of these – I don’t keep track \n13. Don’t know ",null,null,null,null,{"$f":"IFERROR(INDEX(F$3:F$281,SMALL(IF(B$3:B$281=\"In\",ROW(F$2:F$280)-ROW(F$2)+1),ROW(F30))),\"\")","v":""},{"$f":"IFERROR(INDEX(D$3:D$281,SMALL(IF(B$3:B$281=\"In\",ROW(D$2:D$280)-ROW(F$2)+1),ROW(F30))),\"\")","v":""},{"$f":"IFERROR(INDEX(E$3:E$281,SMALL(IF(B$3:B$281=\"In\",ROW(E$2:E$280)-ROW(E$2)+1),ROW(E30))),\"\")","v":""},{"$f":"IFERROR(INDEX(G$3:G$281,SMALL(IF(B$3:B$281=\"In\",ROW(F$2:F$280)-ROW(F$2)+1),ROW(F30))),\"\")","v":""},{"$f":"IFERROR(INDEX(H$3:H$281,SMALL(IF(B$3:B$281=\"In\",ROW(H$2:H$280)-ROW(G$2)+1),ROW(G30))),\"\")","v":""},{"$f":"IFERROR(INDEX(I$3:I$281,SMALL(IF(B$3:B$281=\"In\",ROW(I$2:I$280)-ROW(H$2)+1),ROW(H30))),\"\")","v":""},{"$f":"IFERROR(INDEX(J$3:J$281,SMALL(IF(B$3:B$281=\"In\",ROW(J$2:J$280)-ROW(I$2)+1),ROW(I30))),\"\")","v":""},{"$f":"IFERROR(INDEX(K$3:K$281,SMALL(IF(B$3:B$281=\"In\",ROW(K$2:K$280)-ROW(J$2)+1),ROW(J30))),\"\")","v":""},{"$f":"IFERROR(INDEX(L$3:L$281,SMALL(IF(B$3:B$281=\"In\",ROW(L$2:L$280)-ROW(K$2)+1),ROW(K30))),\"\")","v":""}]
[false,"Out","MWDTD","Behaviours","N",31,"Keeping track of income and spending","Creating and sticking to a viable budget","Frequency of sticking to budget","CitA 3","A) How closely do you normally plan how you will spend your money over the coming week or month? For example by drawing up a budget.\nCHOOSE ONE ONLY\n\n1. Very closely\n2. Fairly closely\n3. Not very closely\n4. I do not plan my spending at all\n5. Don't know\n\nB) And, how often do you keep to the budget you set?\nCHOOSE ONE ONLY\n\n1. Always \n2. Most of the time\n3. Sometimes\n4. Hardly ever\n5. Never\n6. Do not budget",null,null,null,null,{"$f":"IFERROR(INDEX(F$3:F$281,SMALL(IF(B$3:B$281=\"In\",ROW(F$2:F$280)-ROW(F$2)+1),ROW(F31))),\"\")","v":""},{"$f":"IFERROR(INDEX(D$3:D$281,SMALL(IF(B$3:B$281=\"In\",ROW(D$2:D$280)-ROW(F$2)+1),ROW(F31))),\"\")","v":""},{"$f":"IFERROR(INDEX(E$3:E$281,SMALL(IF(B$3:B$281=\"In\",ROW(E$2:E$280)-ROW(E$2)+1),ROW(E31))),\"\")","v":""},{"$f":"IFERROR(INDEX(G$3:G$281,SMALL(IF(B$3:B$281=\"In\",ROW(F$2:F$280)-ROW(F$2)+1),ROW(F31))),\"\")","v":""},{"$f":"IFERROR(INDEX(H$3:H$281,SMALL(IF(B$3:B$281=\"In\",ROW(H$2:H$280)-ROW(G$2)+1),ROW(G31))),\"\")","v":""},{"$f":"IFERROR(INDEX(I$3:I$281,SMALL(IF(B$3:B$281=\"In\",ROW(I$2:I$280)-ROW(H$2)+1),ROW(H31))),\"\")","v":""},{"$f":"IFERROR(INDEX(J$3:J$281,SMALL(IF(B$3:B$281=\"In\",ROW(J$2:J$280)-ROW(I$2)+1),ROW(I31))),\"\")","v":""},{"$f":"IFERROR(INDEX(K$3:K$281,SMALL(IF(B$3:B$281=\"In\",ROW(K$2:K$280)-ROW(J$2)+1),ROW(J31))),\"\")","v":""},{"$f":"IFERROR(INDEX(L$3:L$281,SMALL(IF(B$3:B$281=\"In\",ROW(L$2:L$280)-ROW(K$2)+1),ROW(K31))),\"\")","v":""}]
[false,"Out","MWDTD","Behaviours","Y",32,"Keeping track of income and spending","Creating and sticking to a viable budget","Whether keeping track of income","FinCao 2018 - i1x","How closely do you keep track of your/your household’s income and expenditure?\n\n1. Very closely\n2. Fairly closely\n3. Not very closely\n4. Not at all\n5. Don’t know",null,null,null,null,{"$f":"IFERROR(INDEX(F$3:F$281,SMALL(IF(B$3:B$281=\"In\",ROW(F$2:F$280)-ROW(F$2)+1),ROW(F32))),\"\")","v":""},{"$f":"IFERROR(INDEX(D$3:D$281,SMALL(IF(B$3:B$281=\"In\",ROW(D$2:D$280)-ROW(F$2)+1),ROW(F32))),\"\")","v":""},{"$f":"IFERROR(INDEX(E$3:E$281,SMALL(IF(B$3:B$281=\"In\",ROW(E$2:E$280)-ROW(E$2)+1),ROW(E32))),\"\")","v":""},{"$f":"IFERROR(INDEX(G$3:G$281,SMALL(IF(B$3:B$281=\"In\",ROW(F$2:F$280)-ROW(F$2)+1),ROW(F32))),\"\")","v":""},{"$f":"IFERROR(INDEX(H$3:H$281,SMALL(IF(B$3:B$281=\"In\",ROW(H$2:H$280)-ROW(G$2)+1),ROW(G32))),\"\")","v":""},{"$f":"IFERROR(INDEX(I$3:I$281,SMALL(IF(B$3:B$281=\"In\",ROW(I$2:I$280)-ROW(H$2)+1),ROW(H32))),\"\")","v":""},{"$f":"IFERROR(INDEX(J$3:J$281,SMALL(IF(B$3:B$281=\"In\",ROW(J$2:J$280)-ROW(I$2)+1),ROW(I32))),\"\")","v":""},{"$f":"IFERROR(INDEX(K$3:K$281,SMALL(IF(B$3:B$281=\"In\",ROW(K$2:K$280)-ROW(J$2)+1),ROW(J32))),\"\")","v":""},{"$f":"IFERROR(INDEX(L$3:L$281,SMALL(IF(B$3:B$281=\"In\",ROW(L$2:L$280)-ROW(K$2)+1),ROW(K32))),\"\")","v":""}]
[false,"Out","MWDTD","Behaviours","N",33,"Managing bill payments"," ","Frequency of missed bill payments ","DAE Q19","How often do you delay or miss paying a bill, beyond the date it becomes due?\nCHOOSE ONE ONLY\n\n1. I often do this \n2. I occasionally do this \n3. I rarely do this \n4. I never do this",null,null,null,null,{"$f":"IFERROR(INDEX(F$3:F$281,SMALL(IF(B$3:B$281=\"In\",ROW(F$2:F$280)-ROW(F$2)+1),ROW(F33))),\"\")","v":""},{"$f":"IFERROR(INDEX(D$3:D$281,SMALL(IF(B$3:B$281=\"In\",ROW(D$2:D$280)-ROW(F$2)+1),ROW(F33))),\"\")","v":""},{"$f":"IFERROR(INDEX(E$3:E$281,SMALL(IF(B$3:B$281=\"In\",ROW(E$2:E$280)-ROW(E$2)+1),ROW(E33))),\"\")","v":""},{"$f":"IFERROR(INDEX(G$3:G$281,SMALL(IF(B$3:B$281=\"In\",ROW(F$2:F$280)-ROW(F$2)+1),ROW(F33))),\"\")","v":""},{"$f":"IFERROR(INDEX(H$3:H$281,SMALL(IF(B$3:B$281=\"In\",ROW(H$2:H$280)-ROW(G$2)+1),ROW(G33))),\"\")","v":""},{"$f":"IFERROR(INDEX(I$3:I$281,SMALL(IF(B$3:B$281=\"In\",ROW(I$2:I$280)-ROW(H$2)+1),ROW(H33))),\"\")","v":""},{"$f":"IFERROR(INDEX(J$3:J$281,SMALL(IF(B$3:B$281=\"In\",ROW(J$2:J$280)-ROW(I$2)+1),ROW(I33))),\"\")","v":""},{"$f":"IFERROR(INDEX(K$3:K$281,SMALL(IF(B$3:B$281=\"In\",ROW(K$2:K$280)-ROW(J$2)+1),ROW(J33))),\"\")","v":""},{"$f":"IFERROR(INDEX(L$3:L$281,SMALL(IF(B$3:B$281=\"In\",ROW(L$2:L$280)-ROW(K$2)+1),ROW(K33))),\"\")","v":""}]
[false,"Out","MWDTD","Behaviours","N ",34,"Managing bill payments"," ","Quality of planning to pay bills","BASE Qbplan","How well do you usually plan ahead to make sure you have the money to pay for regular bills and expenses? \nCHOOSE ONE ONLY\n\n1. Plan ahead to cover the full amount\n2. Plan ahead to cover some of the amount\n3. Don't plan ahead because there is always enough money to cover them\n4. Don't plan ahead at all\n",null,null,null,null,{"$f":"IFERROR(INDEX(F$3:F$281,SMALL(IF(B$3:B$281=\"In\",ROW(F$2:F$280)-ROW(F$2)+1),ROW(F34))),\"\")","v":""},{"$f":"IFERROR(INDEX(D$3:D$281,SMALL(IF(B$3:B$281=\"In\",ROW(D$2:D$280)-ROW(F$2)+1),ROW(F34))),\"\")","v":""},{"$f":"IFERROR(INDEX(E$3:E$281,SMALL(IF(B$3:B$281=\"In\",ROW(E$2:E$280)-ROW(E$2)+1),ROW(E34))),\"\")","v":""},{"$f":"IFERROR(INDEX(G$3:G$281,SMALL(IF(B$3:B$281=\"In\",ROW(F$2:F$280)-ROW(F$2)+1),ROW(F34))),\"\")","v":""},{"$f":"IFERROR(INDEX(H$3:H$281,SMALL(IF(B$3:B$281=\"In\",ROW(H$2:H$280)-ROW(G$2)+1),ROW(G34))),\"\")","v":""},{"$f":"IFERROR(INDEX(I$3:I$281,SMALL(IF(B$3:B$281=\"In\",ROW(I$2:I$280)-ROW(H$2)+1),ROW(H34))),\"\")","v":""},{"$f":"IFERROR(INDEX(J$3:J$281,SMALL(IF(B$3:B$281=\"In\",ROW(J$2:J$280)-ROW(I$2)+1),ROW(I34))),\"\")","v":""},{"$f":"IFERROR(INDEX(K$3:K$281,SMALL(IF(B$3:B$281=\"In\",ROW(K$2:K$280)-ROW(J$2)+1),ROW(J34))),\"\")","v":""},{"$f":"IFERROR(INDEX(L$3:L$281,SMALL(IF(B$3:B$281=\"In\",ROW(L$2:L$280)-ROW(K$2)+1),ROW(K34))),\"\")","v":""}]
[false,"Out","MWDTD","Behaviours","Y",35,"Not borrowing for every day spending",null,"Frequency of borrowing money to pay off debts","Norway - NORB11","How often do you/your household borrow money to pay off debts? \n\n1. Very often\n2. Fairly often\n3. Sometimes\n4. Not very often\n5. Never\n6. Don’t know",null,null,null,null,{"$f":"IFERROR(INDEX(F$3:F$281,SMALL(IF(B$3:B$281=\"In\",ROW(F$2:F$280)-ROW(F$2)+1),ROW(F35))),\"\")","v":""},{"$f":"IFERROR(INDEX(D$3:D$281,SMALL(IF(B$3:B$281=\"In\",ROW(D$2:D$280)-ROW(F$2)+1),ROW(F35))),\"\")","v":""},{"$f":"IFERROR(INDEX(E$3:E$281,SMALL(IF(B$3:B$281=\"In\",ROW(E$2:E$280)-ROW(E$2)+1),ROW(E35))),\"\")","v":""},{"$f":"IFERROR(INDEX(G$3:G$281,SMALL(IF(B$3:B$281=\"In\",ROW(F$2:F$280)-ROW(F$2)+1),ROW(F35))),\"\")","v":""},{"$f":"IFERROR(INDEX(H$3:H$281,SMALL(IF(B$3:B$281=\"In\",ROW(H$2:H$280)-ROW(G$2)+1),ROW(G35))),\"\")","v":""},{"$f":"IFERROR(INDEX(I$3:I$281,SMALL(IF(B$3:B$281=\"In\",ROW(I$2:I$280)-ROW(H$2)+1),ROW(H35))),\"\")","v":""},{"$f":"IFERROR(INDEX(J$3:J$281,SMALL(IF(B$3:B$281=\"In\",ROW(J$2:J$280)-ROW(I$2)+1),ROW(I35))),\"\")","v":""},{"$f":"IFERROR(INDEX(K$3:K$281,SMALL(IF(B$3:B$281=\"In\",ROW(K$2:K$280)-ROW(J$2)+1),ROW(J35))),\"\")","v":""},{"$f":"IFERROR(INDEX(L$3:L$281,SMALL(IF(B$3:B$281=\"In\",ROW(L$2:L$280)-ROW(K$2)+1),ROW(K35))),\"\")","v":""}]
[false,"Out","MWDTD","Behaviours","Y",36,"Not borrowing for every day spending",null,"How often borrows from friends and family","Fincap 2018 C7","How often do you/your household borrow from family/friends because you have run out of money?\n\n1. Very often\n2. Fairly often\n3. Sometimes\n4. Not very often\n5. Never\n6. Don’t know",null,null,null,null,{"$f":"IFERROR(INDEX(F$3:F$281,SMALL(IF(B$3:B$281=\"In\",ROW(F$2:F$280)-ROW(F$2)+1),ROW(F36))),\"\")","v":""},{"$f":"IFERROR(INDEX(D$3:D$281,SMALL(IF(B$3:B$281=\"In\",ROW(D$2:D$280)-ROW(F$2)+1),ROW(F36))),\"\")","v":""},{"$f":"IFERROR(INDEX(E$3:E$281,SMALL(IF(B$3:B$281=\"In\",ROW(E$2:E$280)-ROW(E$2)+1),ROW(E36))),\"\")","v":""},{"$f":"IFERROR(INDEX(G$3:G$281,SMALL(IF(B$3:B$281=\"In\",ROW(F$2:F$280)-ROW(F$2)+1),ROW(F36))),\"\")","v":""},{"$f":"IFERROR(INDEX(H$3:H$281,SMALL(IF(B$3:B$281=\"In\",ROW(H$2:H$280)-ROW(G$2)+1),ROW(G36))),\"\")","v":""},{"$f":"IFERROR(INDEX(I$3:I$281,SMALL(IF(B$3:B$281=\"In\",ROW(I$2:I$280)-ROW(H$2)+1),ROW(H36))),\"\")","v":""},{"$f":"IFERROR(INDEX(J$3:J$281,SMALL(IF(B$3:B$281=\"In\",ROW(J$2:J$280)-ROW(I$2)+1),ROW(I36))),\"\")","v":""},{"$f":"IFERROR(INDEX(K$3:K$281,SMALL(IF(B$3:B$281=\"In\",ROW(K$2:K$280)-ROW(J$2)+1),ROW(J36))),\"\")","v":""},{"$f":"IFERROR(INDEX(L$3:L$281,SMALL(IF(B$3:B$281=\"In\",ROW(L$2:L$280)-ROW(K$2)+1),ROW(K36))),\"\")","v":""}]
[false,"Out","MWDTD","Behaviours","Y",37,"Not borrowing for every day spending",null,"Frequency of borrowing money to buy food or to pay expenses","Norway - NORB10","How often do you/your household use a credit card, overdraft or borrow money to buy food or pay bills because\nyou’ve run short of money?\n\n1. Very often\n2. Fairly often\n3. Sometimes\n4. Not very often\n5. Never\n6. Don’t know",null,null,null,null,{"$f":"IFERROR(INDEX(F$3:F$281,SMALL(IF(B$3:B$281=\"In\",ROW(F$2:F$280)-ROW(F$2)+1),ROW(F37))),\"\")","v":""},{"$f":"IFERROR(INDEX(D$3:D$281,SMALL(IF(B$3:B$281=\"In\",ROW(D$2:D$280)-ROW(F$2)+1),ROW(F37))),\"\")","v":""},{"$f":"IFERROR(INDEX(E$3:E$281,SMALL(IF(B$3:B$281=\"In\",ROW(E$2:E$280)-ROW(E$2)+1),ROW(E37))),\"\")","v":""},{"$f":"IFERROR(INDEX(G$3:G$281,SMALL(IF(B$3:B$281=\"In\",ROW(F$2:F$280)-ROW(F$2)+1),ROW(F37))),\"\")","v":""},{"$f":"IFERROR(INDEX(H$3:H$281,SMALL(IF(B$3:B$281=\"In\",ROW(H$2:H$280)-ROW(G$2)+1),ROW(G37))),\"\")","v":""},{"$f":"IFERROR(INDEX(I$3:I$281,SMALL(IF(B$3:B$281=\"In\",ROW(I$2:I$280)-ROW(H$2)+1),ROW(H37))),\"\")","v":""},{"$f":"IFERROR(INDEX(J$3:J$281,SMALL(IF(B$3:B$281=\"In\",ROW(J$2:J$280)-ROW(I$2)+1),ROW(I37))),\"\")","v":""},{"$f":"IFERROR(INDEX(K$3:K$281,SMALL(IF(B$3:B$281=\"In\",ROW(K$2:K$280)-ROW(J$2)+1),ROW(J37))),\"\")","v":""},{"$f":"IFERROR(INDEX(L$3:L$281,SMALL(IF(B$3:B$281=\"In\",ROW(L$2:L$280)-ROW(K$2)+1),ROW(K37))),\"\")","v":""}]
[false,"Out","MWDTD","Behaviours","Y",38,"Not borrowing for every day spending",null,"Frequency of being overdrawn on current account","Norway - NORB16","How often you are overdrawn on your current account?\n \n1. Very often\n2. Fairly often\n3. Sometimes\n4. Not very often\n5. Never\n6. Don’t know",null,null,null,null,{"$f":"IFERROR(INDEX(F$3:F$281,SMALL(IF(B$3:B$281=\"In\",ROW(F$2:F$280)-ROW(F$2)+1),ROW(F38))),\"\")","v":""},{"$f":"IFERROR(INDEX(D$3:D$281,SMALL(IF(B$3:B$281=\"In\",ROW(D$2:D$280)-ROW(F$2)+1),ROW(F38))),\"\")","v":""},{"$f":"IFERROR(INDEX(E$3:E$281,SMALL(IF(B$3:B$281=\"In\",ROW(E$2:E$280)-ROW(E$2)+1),ROW(E38))),\"\")","v":""},{"$f":"IFERROR(INDEX(G$3:G$281,SMALL(IF(B$3:B$281=\"In\",ROW(F$2:F$280)-ROW(F$2)+1),ROW(F38))),\"\")","v":""},{"$f":"IFERROR(INDEX(H$3:H$281,SMALL(IF(B$3:B$281=\"In\",ROW(H$2:H$280)-ROW(G$2)+1),ROW(G38))),\"\")","v":""},{"$f":"IFERROR(INDEX(I$3:I$281,SMALL(IF(B$3:B$281=\"In\",ROW(I$2:I$280)-ROW(H$2)+1),ROW(H38))),\"\")","v":""},{"$f":"IFERROR(INDEX(J$3:J$281,SMALL(IF(B$3:B$281=\"In\",ROW(J$2:J$280)-ROW(I$2)+1),ROW(I38))),\"\")","v":""},{"$f":"IFERROR(INDEX(K$3:K$281,SMALL(IF(B$3:B$281=\"In\",ROW(K$2:K$280)-ROW(J$2)+1),ROW(J38))),\"\")","v":""},{"$f":"IFERROR(INDEX(L$3:L$281,SMALL(IF(B$3:B$281=\"In\",ROW(L$2:L$280)-ROW(K$2)+1),ROW(K38))),\"\")","v":""}]
[false,"Out","MWDTD","Behaviours","Y",39,"Not borrowing for every day spending",null,"Types of short-term high-cost credit used in the last year","FinCap E6","In the last year, have you taken out any of the following? \nPLEASE SELECT ALL THAT APPLY \n1. Payday loan - one repayment on payday or at the end of the month (e.g. Wonga, QuickQuid, Express Finance or Payday UK) \n2. Other short-term credit – like a payday loan but repaid in instalments(e.g. Peachy, Cash Genie, Lending Stream) \n3. Pawn broker loan–borrow money against an item you pawn \n4. Other (please specify) \n5. None of these \n6. Don’t know/can’t remember ",null,null,null,null,{"$f":"IFERROR(INDEX(F$3:F$281,SMALL(IF(B$3:B$281=\"In\",ROW(F$2:F$280)-ROW(F$2)+1),ROW(F39))),\"\")","v":""},{"$f":"IFERROR(INDEX(D$3:D$281,SMALL(IF(B$3:B$281=\"In\",ROW(D$2:D$280)-ROW(F$2)+1),ROW(F39))),\"\")","v":""},{"$f":"IFERROR(INDEX(E$3:E$281,SMALL(IF(B$3:B$281=\"In\",ROW(E$2:E$280)-ROW(E$2)+1),ROW(E39))),\"\")","v":""},{"$f":"IFERROR(INDEX(G$3:G$281,SMALL(IF(B$3:B$281=\"In\",ROW(F$2:F$280)-ROW(F$2)+1),ROW(F39))),\"\")","v":""},{"$f":"IFERROR(INDEX(H$3:H$281,SMALL(IF(B$3:B$281=\"In\",ROW(H$2:H$280)-ROW(G$2)+1),ROW(G39))),\"\")","v":""},{"$f":"IFERROR(INDEX(I$3:I$281,SMALL(IF(B$3:B$281=\"In\",ROW(I$2:I$280)-ROW(H$2)+1),ROW(H39))),\"\")","v":""},{"$f":"IFERROR(INDEX(J$3:J$281,SMALL(IF(B$3:B$281=\"In\",ROW(J$2:J$280)-ROW(I$2)+1),ROW(I39))),\"\")","v":""},{"$f":"IFERROR(INDEX(K$3:K$281,SMALL(IF(B$3:B$281=\"In\",ROW(K$2:K$280)-ROW(J$2)+1),ROW(J39))),\"\")","v":""},{"$f":"IFERROR(INDEX(L$3:L$281,SMALL(IF(B$3:B$281=\"In\",ROW(L$2:L$280)-ROW(K$2)+1),ROW(K39))),\"\")","v":""}]
[false,"Out","MWDTD","Behaviours","Y",40,"Adjusting spending","Plans spending to cover tight months","Plans spending to cover tight months","FinCap 2018 sf1","To what extent would you say the following statement apply to you personally?\nI plan my spending to cover months where I expect money will be tighter\n\nPlease answer on a scale of 0 to 10, where 0 means it doesn’t sound like you at all and 10 means it sounds a lot like you\n\n1. 0 Does not sound like me at all\n2. 1\n3. 2\n4. 3\n5. 4\n6. 5\n7. 6\n8. 7\n9. 8\n10. 9\n11. 10 Sounds a lot like me\n12. Don’t know\n13. Not applicable",null,null,null,null,{"$f":"IFERROR(INDEX(F$3:F$281,SMALL(IF(B$3:B$281=\"In\",ROW(F$2:F$280)-ROW(F$2)+1),ROW(F40))),\"\")","v":""},{"$f":"IFERROR(INDEX(D$3:D$281,SMALL(IF(B$3:B$281=\"In\",ROW(D$2:D$280)-ROW(F$2)+1),ROW(F40))),\"\")","v":""},{"$f":"IFERROR(INDEX(E$3:E$281,SMALL(IF(B$3:B$281=\"In\",ROW(E$2:E$280)-ROW(E$2)+1),ROW(E40))),\"\")","v":""},{"$f":"IFERROR(INDEX(G$3:G$281,SMALL(IF(B$3:B$281=\"In\",ROW(F$2:F$280)-ROW(F$2)+1),ROW(F40))),\"\")","v":""},{"$f":"IFERROR(INDEX(H$3:H$281,SMALL(IF(B$3:B$281=\"In\",ROW(H$2:H$280)-ROW(G$2)+1),ROW(G40))),\"\")","v":""},{"$f":"IFERROR(INDEX(I$3:I$281,SMALL(IF(B$3:B$281=\"In\",ROW(I$2:I$280)-ROW(H$2)+1),ROW(H40))),\"\")","v":""},{"$f":"IFERROR(INDEX(J$3:J$281,SMALL(IF(B$3:B$281=\"In\",ROW(J$2:J$280)-ROW(I$2)+1),ROW(I40))),\"\")","v":""},{"$f":"IFERROR(INDEX(K$3:K$281,SMALL(IF(B$3:B$281=\"In\",ROW(K$2:K$280)-ROW(J$2)+1),ROW(J40))),\"\")","v":""},{"$f":"IFERROR(INDEX(L$3:L$281,SMALL(IF(B$3:B$281=\"In\",ROW(L$2:L$280)-ROW(K$2)+1),ROW(K40))),\"\")","v":""}]
[false,"Out","MWDTD","Behaviours","Y",41,"Adjusting spending","Changes spending as a result of keeping track","How much changes spending as a result of keeping track","FinCap 2018 I2X ","How closely do you keep track of your/your household’s income and expenditure?\n1. Very closely\n2. Fairly closely\n3. Not very closely\n4. Not at all\n5. Don’t know\nASK ALL\n\nHow much, if at all, do you change what you spend as a result of this?\n1. Great deal\n2. Fair amount\n3. Not very much\n4. Not at all\n5. Don't know",null,null,null,null,{"$f":"IFERROR(INDEX(F$3:F$281,SMALL(IF(B$3:B$281=\"In\",ROW(F$2:F$280)-ROW(F$2)+1),ROW(F41))),\"\")","v":""},{"$f":"IFERROR(INDEX(D$3:D$281,SMALL(IF(B$3:B$281=\"In\",ROW(D$2:D$280)-ROW(F$2)+1),ROW(F41))),\"\")","v":""},{"$f":"IFERROR(INDEX(E$3:E$281,SMALL(IF(B$3:B$281=\"In\",ROW(E$2:E$280)-ROW(E$2)+1),ROW(E41))),\"\")","v":""},{"$f":"IFERROR(INDEX(G$3:G$281,SMALL(IF(B$3:B$281=\"In\",ROW(F$2:F$280)-ROW(F$2)+1),ROW(F41))),\"\")","v":""},{"$f":"IFERROR(INDEX(H$3:H$281,SMALL(IF(B$3:B$281=\"In\",ROW(H$2:H$280)-ROW(G$2)+1),ROW(G41))),\"\")","v":""},{"$f":"IFERROR(INDEX(I$3:I$281,SMALL(IF(B$3:B$281=\"In\",ROW(I$2:I$280)-ROW(H$2)+1),ROW(H41))),\"\")","v":""},{"$f":"IFERROR(INDEX(J$3:J$281,SMALL(IF(B$3:B$281=\"In\",ROW(J$2:J$280)-ROW(I$2)+1),ROW(I41))),\"\")","v":""},{"$f":"IFERROR(INDEX(K$3:K$281,SMALL(IF(B$3:B$281=\"In\",ROW(K$2:K$280)-ROW(J$2)+1),ROW(J41))),\"\")","v":""},{"$f":"IFERROR(INDEX(L$3:L$281,SMALL(IF(B$3:B$281=\"In\",ROW(L$2:L$280)-ROW(K$2)+1),ROW(K41))),\"\")","v":""}]
[false,"Out","MWDTD","Behaviours","Y",42,"Adjusting spending","Adjusts spending on non-essentials when life changes","Willingness to adjust non-essential spending","FinCap O4B "," To what extent would you say the following statement apply to you personally?\nI am prepared to adjust the amount of money I spend on non-essentials if my life changes \n\nPlease answer on a scale of 0 to 10, where 0 means it doesn’t sound like you at all and 10 means it sounds a lot like you\n\n1. 0 Does not sound like me at all\n2. 1\n3. 2\n4. 3\n5. 4\n6. 5\n7. 6\n8. 7\n9. 8\n10. 9\n11. 10 Sounds a lot like me\n12. Don’t know",null,null,null,null,{"$f":"IFERROR(INDEX(F$3:F$281,SMALL(IF(B$3:B$281=\"In\",ROW(F$2:F$280)-ROW(F$2)+1),ROW(F42))),\"\")","v":""},{"$f":"IFERROR(INDEX(D$3:D$281,SMALL(IF(B$3:B$281=\"In\",ROW(D$2:D$280)-ROW(F$2)+1),ROW(F42))),\"\")","v":""},{"$f":"IFERROR(INDEX(E$3:E$281,SMALL(IF(B$3:B$281=\"In\",ROW(E$2:E$280)-ROW(E$2)+1),ROW(E42))),\"\")","v":""},{"$f":"IFERROR(INDEX(G$3:G$281,SMALL(IF(B$3:B$281=\"In\",ROW(F$2:F$280)-ROW(F$2)+1),ROW(F42))),\"\")","v":""},{"$f":"IFERROR(INDEX(H$3:H$281,SMALL(IF(B$3:B$281=\"In\",ROW(H$2:H$280)-ROW(G$2)+1),ROW(G42))),\"\")","v":""},{"$f":"IFERROR(INDEX(I$3:I$281,SMALL(IF(B$3:B$281=\"In\",ROW(I$2:I$280)-ROW(H$2)+1),ROW(H42))),\"\")","v":""},{"$f":"IFERROR(INDEX(J$3:J$281,SMALL(IF(B$3:B$281=\"In\",ROW(J$2:J$280)-ROW(I$2)+1),ROW(I42))),\"\")","v":""},{"$f":"IFERROR(INDEX(K$3:K$281,SMALL(IF(B$3:B$281=\"In\",ROW(K$2:K$280)-ROW(J$2)+1),ROW(J42))),\"\")","v":""},{"$f":"IFERROR(INDEX(L$3:L$281,SMALL(IF(B$3:B$281=\"In\",ROW(L$2:L$280)-ROW(K$2)+1),ROW(K42))),\"\")","v":""}]
[null,null,null,null,"Y",43,"Shopping around","Shops around for better deals on phone, internet, TV",null,"max1a","How much, if at all, do you shop around for better deals on your phone, internet or tv packages",null,null,null,null,{"$f":"IFERROR(INDEX(F$3:F$281,SMALL(IF(B$3:B$281=\"In\",ROW(F$2:F$280)-ROW(F$2)+1),ROW(F43))),\"\")","v":""},{"$f":"IFERROR(INDEX(D$3:D$281,SMALL(IF(B$3:B$281=\"In\",ROW(D$2:D$280)-ROW(F$2)+1),ROW(F43))),\"\")","v":""},{"$f":"IFERROR(INDEX(E$3:E$281,SMALL(IF(B$3:B$281=\"In\",ROW(E$2:E$280)-ROW(E$2)+1),ROW(E43))),\"\")","v":""},{"$f":"IFERROR(INDEX(G$3:G$281,SMALL(IF(B$3:B$281=\"In\",ROW(F$2:F$280)-ROW(F$2)+1),ROW(F43))),\"\")","v":""},{"$f":"IFERROR(INDEX(H$3:H$281,SMALL(IF(B$3:B$281=\"In\",ROW(H$2:H$280)-ROW(G$2)+1),ROW(G43))),\"\")","v":""},{"$f":"IFERROR(INDEX(I$3:I$281,SMALL(IF(B$3:B$281=\"In\",ROW(I$2:I$280)-ROW(H$2)+1),ROW(H43))),\"\")","v":""},{"$f":"IFERROR(INDEX(J$3:J$281,SMALL(IF(B$3:B$281=\"In\",ROW(J$2:J$280)-ROW(I$2)+1),ROW(I43))),\"\")","v":""},{"$f":"IFERROR(INDEX(K$3:K$281,SMALL(IF(B$3:B$281=\"In\",ROW(K$2:K$280)-ROW(J$2)+1),ROW(J43))),\"\")","v":""},{"$f":"IFERROR(INDEX(L$3:L$281,SMALL(IF(B$3:B$281=\"In\",ROW(L$2:L$280)-ROW(K$2)+1),ROW(K43))),\"\")","v":""}]
[null,null,null,null,"Y",44,"Shopping around","Shops around for better deals on utilities",null,"max1b","How much, if at all, do you shop around for better deals on utilities like gas or electricity",null,null,null,null,{"$f":"IFERROR(INDEX(F$3:F$281,SMALL(IF(B$3:B$281=\"In\",ROW(F$2:F$280)-ROW(F$2)+1),ROW(F44))),\"\")","v":""},{"$f":"IFERROR(INDEX(D$3:D$281,SMALL(IF(B$3:B$281=\"In\",ROW(D$2:D$280)-ROW(F$2)+1),ROW(F44))),\"\")","v":""},{"$f":"IFERROR(INDEX(E$3:E$281,SMALL(IF(B$3:B$281=\"In\",ROW(E$2:E$280)-ROW(E$2)+1),ROW(E44))),\"\")","v":""},{"$f":"IFERROR(INDEX(G$3:G$281,SMALL(IF(B$3:B$281=\"In\",ROW(F$2:F$280)-ROW(F$2)+1),ROW(F44))),\"\")","v":""},{"$f":"IFERROR(INDEX(H$3:H$281,SMALL(IF(B$3:B$281=\"In\",ROW(H$2:H$280)-ROW(G$2)+1),ROW(G44))),\"\")","v":""},{"$f":"IFERROR(INDEX(I$3:I$281,SMALL(IF(B$3:B$281=\"In\",ROW(I$2:I$280)-ROW(H$2)+1),ROW(H44))),\"\")","v":""},{"$f":"IFERROR(INDEX(J$3:J$281,SMALL(IF(B$3:B$281=\"In\",ROW(J$2:J$280)-ROW(I$2)+1),ROW(I44))),\"\")","v":""},{"$f":"IFERROR(INDEX(K$3:K$281,SMALL(IF(B$3:B$281=\"In\",ROW(K$2:K$280)-ROW(J$2)+1),ROW(J44))),\"\")","v":""},{"$f":"IFERROR(INDEX(L$3:L$281,SMALL(IF(B$3:B$281=\"In\",ROW(L$2:L$280)-ROW(K$2)+1),ROW(K44))),\"\")","v":""}]
[null,null,null,null,"Y",45,"Shopping around","Shops around for better deals on savings accounts",null,"max1c","How much, if at all, do you shop around for better deals on bank or savings accounts",null,null,null,null,{"$f":"IFERROR(INDEX(F$3:F$281,SMALL(IF(B$3:B$281=\"In\",ROW(F$2:F$280)-ROW(F$2)+1),ROW(F45))),\"\")","v":""},{"$f":"IFERROR(INDEX(D$3:D$281,SMALL(IF(B$3:B$281=\"In\",ROW(D$2:D$280)-ROW(F$2)+1),ROW(F45))),\"\")","v":""},{"$f":"IFERROR(INDEX(E$3:E$281,SMALL(IF(B$3:B$281=\"In\",ROW(E$2:E$280)-ROW(E$2)+1),ROW(E45))),\"\")","v":""},{"$f":"IFERROR(INDEX(G$3:G$281,SMALL(IF(B$3:B$281=\"In\",ROW(F$2:F$280)-ROW(F$2)+1),ROW(F45))),\"\")","v":""},{"$f":"IFERROR(INDEX(H$3:H$281,SMALL(IF(B$3:B$281=\"In\",ROW(H$2:H$280)-ROW(G$2)+1),ROW(G45))),\"\")","v":""},{"$f":"IFERROR(INDEX(I$3:I$281,SMALL(IF(B$3:B$281=\"In\",ROW(I$2:I$280)-ROW(H$2)+1),ROW(H45))),\"\")","v":""},{"$f":"IFERROR(INDEX(J$3:J$281,SMALL(IF(B$3:B$281=\"In\",ROW(J$2:J$280)-ROW(I$2)+1),ROW(I45))),\"\")","v":""},{"$f":"IFERROR(INDEX(K$3:K$281,SMALL(IF(B$3:B$281=\"In\",ROW(K$2:K$280)-ROW(J$2)+1),ROW(J45))),\"\")","v":""},{"$f":"IFERROR(INDEX(L$3:L$281,SMALL(IF(B$3:B$281=\"In\",ROW(L$2:L$280)-ROW(K$2)+1),ROW(K45))),\"\")","v":""}]
[null,null,null,null,"Y",46,"Shopping around","Shops around for better deals on credit cards",null,"max1d","How much, if at all, do you shop around for better deals on credit cards",null,null,null,null,{"$f":"IFERROR(INDEX(F$3:F$281,SMALL(IF(B$3:B$281=\"In\",ROW(F$2:F$280)-ROW(F$2)+1),ROW(F46))),\"\")","v":""},{"$f":"IFERROR(INDEX(D$3:D$281,SMALL(IF(B$3:B$281=\"In\",ROW(D$2:D$280)-ROW(F$2)+1),ROW(F46))),\"\")","v":""},{"$f":"IFERROR(INDEX(E$3:E$281,SMALL(IF(B$3:B$281=\"In\",ROW(E$2:E$280)-ROW(E$2)+1),ROW(E46))),\"\")","v":""},{"$f":"IFERROR(INDEX(G$3:G$281,SMALL(IF(B$3:B$281=\"In\",ROW(F$2:F$280)-ROW(F$2)+1),ROW(F46))),\"\")","v":""},{"$f":"IFERROR(INDEX(H$3:H$281,SMALL(IF(B$3:B$281=\"In\",ROW(H$2:H$280)-ROW(G$2)+1),ROW(G46))),\"\")","v":""},{"$f":"IFERROR(INDEX(I$3:I$281,SMALL(IF(B$3:B$281=\"In\",ROW(I$2:I$280)-ROW(H$2)+1),ROW(H46))),\"\")","v":""},{"$f":"IFERROR(INDEX(J$3:J$281,SMALL(IF(B$3:B$281=\"In\",ROW(J$2:J$280)-ROW(I$2)+1),ROW(I46))),\"\")","v":""},{"$f":"IFERROR(INDEX(K$3:K$281,SMALL(IF(B$3:B$281=\"In\",ROW(K$2:K$280)-ROW(J$2)+1),ROW(J46))),\"\")","v":""},{"$f":"IFERROR(INDEX(L$3:L$281,SMALL(IF(B$3:B$281=\"In\",ROW(L$2:L$280)-ROW(K$2)+1),ROW(K46))),\"\")","v":""}]
[null,null,null,null,"Y",47,"Shopping around","Shops around for better deals on insurance",null,"max1e","How much, if at all, do you shop around for better deals on car or home insurance",null,null,null,null,{"$f":"IFERROR(INDEX(F$3:F$281,SMALL(IF(B$3:B$281=\"In\",ROW(F$2:F$280)-ROW(F$2)+1),ROW(F47))),\"\")","v":""},{"$f":"IFERROR(INDEX(D$3:D$281,SMALL(IF(B$3:B$281=\"In\",ROW(D$2:D$280)-ROW(F$2)+1),ROW(F47))),\"\")","v":""},{"$f":"IFERROR(INDEX(E$3:E$281,SMALL(IF(B$3:B$281=\"In\",ROW(E$2:E$280)-ROW(E$2)+1),ROW(E47))),\"\")","v":""},{"$f":"IFERROR(INDEX(G$3:G$281,SMALL(IF(B$3:B$281=\"In\",ROW(F$2:F$280)-ROW(F$2)+1),ROW(F47))),\"\")","v":""},{"$f":"IFERROR(INDEX(H$3:H$281,SMALL(IF(B$3:B$281=\"In\",ROW(H$2:H$280)-ROW(G$2)+1),ROW(G47))),\"\")","v":""},{"$f":"IFERROR(INDEX(I$3:I$281,SMALL(IF(B$3:B$281=\"In\",ROW(I$2:I$280)-ROW(H$2)+1),ROW(H47))),\"\")","v":""},{"$f":"IFERROR(INDEX(J$3:J$281,SMALL(IF(B$3:B$281=\"In\",ROW(J$2:J$280)-ROW(I$2)+1),ROW(I47))),\"\")","v":""},{"$f":"IFERROR(INDEX(K$3:K$281,SMALL(IF(B$3:B$281=\"In\",ROW(K$2:K$280)-ROW(J$2)+1),ROW(J47))),\"\")","v":""},{"$f":"IFERROR(INDEX(L$3:L$281,SMALL(IF(B$3:B$281=\"In\",ROW(L$2:L$280)-ROW(K$2)+1),ROW(K47))),\"\")","v":""}]
[false,{"$f":"IF(A50=TRUE,\"In\",\"Out\")","v":"Out"},"MWDTD","Behaviours","Y",48,"Shopping around"," ","Regularity of shopping around to get the best deal  ","Fincap 2018 MAX1B","How much, if at all, do you shop around for better deals on…\nA - utilities like gas or electricity\nB - your phone, internet or tv packages\nE – car or home insurance\nF – bank or savings accounts\nG - credit cards\n\n1. Not at all\n2. Not very much\n3. Fair amount\n4. Great deal\n5. Don’t Know",null,null,null,null,{"$f":"IFERROR(INDEX(F$3:F$281,SMALL(IF(B$3:B$281=\"In\",ROW(F$2:F$280)-ROW(F$2)+1),ROW(F48))),\"\")","v":""},{"$f":"IFERROR(INDEX(D$3:D$281,SMALL(IF(B$3:B$281=\"In\",ROW(D$2:D$280)-ROW(F$2)+1),ROW(F48))),\"\")","v":""},{"$f":"IFERROR(INDEX(E$3:E$281,SMALL(IF(B$3:B$281=\"In\",ROW(E$2:E$280)-ROW(E$2)+1),ROW(E48))),\"\")","v":""},{"$f":"IFERROR(INDEX(G$3:G$281,SMALL(IF(B$3:B$281=\"In\",ROW(F$2:F$280)-ROW(F$2)+1),ROW(F48))),\"\")","v":""},{"$f":"IFERROR(INDEX(H$3:H$281,SMALL(IF(B$3:B$281=\"In\",ROW(H$2:H$280)-ROW(G$2)+1),ROW(G48))),\"\")","v":""},{"$f":"IFERROR(INDEX(I$3:I$281,SMALL(IF(B$3:B$281=\"In\",ROW(I$2:I$280)-ROW(H$2)+1),ROW(H48))),\"\")","v":""},{"$f":"IFERROR(INDEX(J$3:J$281,SMALL(IF(B$3:B$281=\"In\",ROW(J$2:J$280)-ROW(I$2)+1),ROW(I48))),\"\")","v":""},{"$f":"IFERROR(INDEX(K$3:K$281,SMALL(IF(B$3:B$281=\"In\",ROW(K$2:K$280)-ROW(J$2)+1),ROW(J48))),\"\")","v":""},{"$f":"IFERROR(INDEX(L$3:L$281,SMALL(IF(B$3:B$281=\"In\",ROW(L$2:L$280)-ROW(K$2)+1),ROW(K48))),\"\")","v":""}]
[false,"Out","MWDTD","Behaviours","N",49,"Maximising income "," ","Steps taken to make money go further","CitA","Which of the following things, if any, do you currently do to make your money go further?  \nCHOOSE ALL THAT APPLY\n\n1. Shop around for food and groceries \n2. Look out for special offers or reduced items\n3. Plan meals in advance \n4. Make a shopping list\n5. Avoid treats and non-essential items\n6. Use money saving tips\n7. Turn lights/power off at home when they are not in use \n8. None of these",null,null,null,null,{"$f":"IFERROR(INDEX(F$3:F$281,SMALL(IF(B$3:B$281=\"In\",ROW(F$2:F$280)-ROW(F$2)+1),ROW(F49))),\"\")","v":""},{"$f":"IFERROR(INDEX(D$3:D$281,SMALL(IF(B$3:B$281=\"In\",ROW(D$2:D$280)-ROW(F$2)+1),ROW(F49))),\"\")","v":""},{"$f":"IFERROR(INDEX(E$3:E$281,SMALL(IF(B$3:B$281=\"In\",ROW(E$2:E$280)-ROW(E$2)+1),ROW(E49))),\"\")","v":""},{"$f":"IFERROR(INDEX(G$3:G$281,SMALL(IF(B$3:B$281=\"In\",ROW(F$2:F$280)-ROW(F$2)+1),ROW(F49))),\"\")","v":""},{"$f":"IFERROR(INDEX(H$3:H$281,SMALL(IF(B$3:B$281=\"In\",ROW(H$2:H$280)-ROW(G$2)+1),ROW(G49))),\"\")","v":""},{"$f":"IFERROR(INDEX(I$3:I$281,SMALL(IF(B$3:B$281=\"In\",ROW(I$2:I$280)-ROW(H$2)+1),ROW(H49))),\"\")","v":""},{"$f":"IFERROR(INDEX(J$3:J$281,SMALL(IF(B$3:B$281=\"In\",ROW(J$2:J$280)-ROW(I$2)+1),ROW(I49))),\"\")","v":""},{"$f":"IFERROR(INDEX(K$3:K$281,SMALL(IF(B$3:B$281=\"In\",ROW(K$2:K$280)-ROW(J$2)+1),ROW(J49))),\"\")","v":""},{"$f":"IFERROR(INDEX(L$3:L$281,SMALL(IF(B$3:B$281=\"In\",ROW(L$2:L$280)-ROW(K$2)+1),ROW(K49))),\"\")","v":""}]
[false,"Out","MWDTD","Behaviours","N",50,"Maximising income "," ","Claiming benefits and adjusting claim following changes in circumstances","N/A","We have not included a measure of ths behaviour as the actions an individual should take, and when, will differ depending on the their circumstances, the benefits they are claiming and changes to welfare policy.\n\nHouseholds who are claiming benefits must ensure their claim is accurate and up to date following any changes in circumstances, both to ensure that they are getting the full amount they are entitled to and to stop any over-payments, which they might struggle to pay back in the future. \n\nIf your intervention is seeking to maximise beneficiaries' income by supporting them to claim benefits, you might consider using changes to beneficiaries income alongside other administration data (such as whether the advisor helped them to make a claim) to evidence this. Please get in touch with the Money Advice Service if you would like help with deciding how best to measure this outcome.",null,null,null,null,{"$f":"IFERROR(INDEX(F$3:F$281,SMALL(IF(B$3:B$281=\"In\",ROW(F$2:F$280)-ROW(F$2)+1),ROW(F50))),\"\")","v":""},{"$f":"IFERROR(INDEX(D$3:D$281,SMALL(IF(B$3:B$281=\"In\",ROW(D$2:D$280)-ROW(F$2)+1),ROW(F50))),\"\")","v":""},{"$f":"IFERROR(INDEX(E$3:E$281,SMALL(IF(B$3:B$281=\"In\",ROW(E$2:E$280)-ROW(E$2)+1),ROW(E50))),\"\")","v":""},{"$f":"IFERROR(INDEX(G$3:G$281,SMALL(IF(B$3:B$281=\"In\",ROW(F$2:F$280)-ROW(F$2)+1),ROW(F50))),\"\")","v":""},{"$f":"IFERROR(INDEX(H$3:H$281,SMALL(IF(B$3:B$281=\"In\",ROW(H$2:H$280)-ROW(G$2)+1),ROW(G50))),\"\")","v":""},{"$f":"IFERROR(INDEX(I$3:I$281,SMALL(IF(B$3:B$281=\"In\",ROW(I$2:I$280)-ROW(H$2)+1),ROW(H50))),\"\")","v":""},{"$f":"IFERROR(INDEX(J$3:J$281,SMALL(IF(B$3:B$281=\"In\",ROW(J$2:J$280)-ROW(I$2)+1),ROW(I50))),\"\")","v":""},{"$f":"IFERROR(INDEX(K$3:K$281,SMALL(IF(B$3:B$281=\"In\",ROW(K$2:K$280)-ROW(J$2)+1),ROW(J50))),\"\")","v":""},{"$f":"IFERROR(INDEX(L$3:L$281,SMALL(IF(B$3:B$281=\"In\",ROW(L$2:L$280)-ROW(K$2)+1),ROW(K50))),\"\")","v":""}]
[false,"Out","MWDTD","Behaviours","Y",51,"Active saving ","Saving on a regular basis","Frequency of saving and amount saved ","FinCap G3 and G4\n\nCitA Q33","A) Which of these best describes how often you save money? \nCHOOSE ONE ONLY\n\n1. Every month\n2. Most months\n3. Some months, but not others\n4. Rarely/never\n5. Don’t know\n\nB) Just thinking about the months that you save money is the amount that you save…\n\n1. Roughly the same each month\n2. A little different from month to month\n3. Very different from month to month\n4. Don’t know\n\nC) About how much on average do you personally manage to save each month, at the moment? \nENTER AMOUNT IN £\nVaries too much to say",null,null,null,null,{"$f":"IFERROR(INDEX(F$3:F$281,SMALL(IF(B$3:B$281=\"In\",ROW(F$2:F$280)-ROW(F$2)+1),ROW(F51))),\"\")","v":""},{"$f":"IFERROR(INDEX(D$3:D$281,SMALL(IF(B$3:B$281=\"In\",ROW(D$2:D$280)-ROW(F$2)+1),ROW(F51))),\"\")","v":""},{"$f":"IFERROR(INDEX(E$3:E$281,SMALL(IF(B$3:B$281=\"In\",ROW(E$2:E$280)-ROW(E$2)+1),ROW(E51))),\"\")","v":""},{"$f":"IFERROR(INDEX(G$3:G$281,SMALL(IF(B$3:B$281=\"In\",ROW(F$2:F$280)-ROW(F$2)+1),ROW(F51))),\"\")","v":""},{"$f":"IFERROR(INDEX(H$3:H$281,SMALL(IF(B$3:B$281=\"In\",ROW(H$2:H$280)-ROW(G$2)+1),ROW(G51))),\"\")","v":""},{"$f":"IFERROR(INDEX(I$3:I$281,SMALL(IF(B$3:B$281=\"In\",ROW(I$2:I$280)-ROW(H$2)+1),ROW(H51))),\"\")","v":""},{"$f":"IFERROR(INDEX(J$3:J$281,SMALL(IF(B$3:B$281=\"In\",ROW(J$2:J$280)-ROW(I$2)+1),ROW(I51))),\"\")","v":""},{"$f":"IFERROR(INDEX(K$3:K$281,SMALL(IF(B$3:B$281=\"In\",ROW(K$2:K$280)-ROW(J$2)+1),ROW(J51))),\"\")","v":""},{"$f":"IFERROR(INDEX(L$3:L$281,SMALL(IF(B$3:B$281=\"In\",ROW(L$2:L$280)-ROW(K$2)+1),ROW(K51))),\"\")","v":""}]
[false,"Out","PAFLE","Behaviours","Y",52,"Building resilience","Saving for expected and unexpected expenses","Number of expected and unexpected expenses ","Fincap G7 and G8 adapted ","Here is a list of some of the reasons people have said they save. Which, if any, of these are reasons why  you/you and your partner/spouse have savings?  \nPLEASE SELECT ALL THAT APPLY\n\n1. To pay for planned expenses, purchases or events\n2. In case I have to pay for unexpected expenses/purchases\n3. For a rainy day generally\n4. In case my or my partner/spouse's income changes\n5. For my retirement (excluding paying into a pension)\n6. None of these (SINGLE CODE ONLY)\n7. Don’t know (SINGLE CODE ONLY)\n\nWhat planned expenses, purchases or events are you saving for?\nPLEASE SELECT ALL THAT APPLY\n\n1. Deposit to rent own home\n2. Deposit to buy own home\n3. Other expenses to move house\n4. A wedding\n5. Starting a family/having another child\n6. Education for me or my partner/spouse\n7. Education for children/grown-up children\n8. Helping grown-up children to rent a home\n9. Helping grown-up children to buy a home\n10. A holiday\n11. Retirement\n12. Home improvements\n13. Purchasing a car/van/motorbike\n14. Other (please specify)\n15. Don’t know (SINGLE CODE ONLY)",null,null,null,null,{"$f":"IFERROR(INDEX(F$3:F$281,SMALL(IF(B$3:B$281=\"In\",ROW(F$2:F$280)-ROW(F$2)+1),ROW(F52))),\"\")","v":""},{"$f":"IFERROR(INDEX(D$3:D$281,SMALL(IF(B$3:B$281=\"In\",ROW(D$2:D$280)-ROW(F$2)+1),ROW(F52))),\"\")","v":""},{"$f":"IFERROR(INDEX(E$3:E$281,SMALL(IF(B$3:B$281=\"In\",ROW(E$2:E$280)-ROW(E$2)+1),ROW(E52))),\"\")","v":""},{"$f":"IFERROR(INDEX(G$3:G$281,SMALL(IF(B$3:B$281=\"In\",ROW(F$2:F$280)-ROW(F$2)+1),ROW(F52))),\"\")","v":""},{"$f":"IFERROR(INDEX(H$3:H$281,SMALL(IF(B$3:B$281=\"In\",ROW(H$2:H$280)-ROW(G$2)+1),ROW(G52))),\"\")","v":""},{"$f":"IFERROR(INDEX(I$3:I$281,SMALL(IF(B$3:B$281=\"In\",ROW(I$2:I$280)-ROW(H$2)+1),ROW(H52))),\"\")","v":""},{"$f":"IFERROR(INDEX(J$3:J$281,SMALL(IF(B$3:B$281=\"In\",ROW(J$2:J$280)-ROW(I$2)+1),ROW(I52))),\"\")","v":""},{"$f":"IFERROR(INDEX(K$3:K$281,SMALL(IF(B$3:B$281=\"In\",ROW(K$2:K$280)-ROW(J$2)+1),ROW(J52))),\"\")","v":""},{"$f":"IFERROR(INDEX(L$3:L$281,SMALL(IF(B$3:B$281=\"In\",ROW(L$2:L$280)-ROW(K$2)+1),ROW(K52))),\"\")","v":""}]
[null,null,"PAFLE","Behaviours","Y",53,"Building resilience ","Increasing the total amount saved","Amount in personal savings and investments (excluding pension)","Fincap G5","A) Approximately how much, if anything, do you personally have in savings and investments? Please do not include any money that you have saved in a pension. \n\n1. ENTER EXACT AMOUNT\n2. I do not have any savings and investments\n3. Don’t know \n4. Prefer not to say \n\nB) Could you estimate the total within the following bands?\nCHOOSE ONE ONLY\n\n1. £100 or less\n2. £101 - £500\n3. £501 - £1,000\n4. £1,001 - £9,999\n5. £10,000 - £19,999\n6. £20,000 or more\n7. Don’t know\n8. Prefer not to say ",null,null,null,null,{"$f":"IFERROR(INDEX(F$3:F$281,SMALL(IF(B$3:B$281=\"In\",ROW(F$2:F$280)-ROW(F$2)+1),ROW(F53))),\"\")","v":""},{"$f":"IFERROR(INDEX(D$3:D$281,SMALL(IF(B$3:B$281=\"In\",ROW(D$2:D$280)-ROW(F$2)+1),ROW(F53))),\"\")","v":""},{"$f":"IFERROR(INDEX(E$3:E$281,SMALL(IF(B$3:B$281=\"In\",ROW(E$2:E$280)-ROW(E$2)+1),ROW(E53))),\"\")","v":""},{"$f":"IFERROR(INDEX(G$3:G$281,SMALL(IF(B$3:B$281=\"In\",ROW(F$2:F$280)-ROW(F$2)+1),ROW(F53))),\"\")","v":""},{"$f":"IFERROR(INDEX(H$3:H$281,SMALL(IF(B$3:B$281=\"In\",ROW(H$2:H$280)-ROW(G$2)+1),ROW(G53))),\"\")","v":""},{"$f":"IFERROR(INDEX(I$3:I$281,SMALL(IF(B$3:B$281=\"In\",ROW(I$2:I$280)-ROW(H$2)+1),ROW(H53))),\"\")","v":""},{"$f":"IFERROR(INDEX(J$3:J$281,SMALL(IF(B$3:B$281=\"In\",ROW(J$2:J$280)-ROW(I$2)+1),ROW(I53))),\"\")","v":""},{"$f":"IFERROR(INDEX(K$3:K$281,SMALL(IF(B$3:B$281=\"In\",ROW(K$2:K$280)-ROW(J$2)+1),ROW(J53))),\"\")","v":""},{"$f":"IFERROR(INDEX(L$3:L$281,SMALL(IF(B$3:B$281=\"In\",ROW(L$2:L$280)-ROW(K$2)+1),ROW(K53))),\"\")","v":""}]
[false,"Out","PAFLE","Behaviours","Y",54,"Working towards financial goals ","Planning to acheive specific financial goals","Count of goals and level of plan ","Fincap D2 & D3","A) Which, if any, of these financial goals do you have for the next five years?\nPLEASE SELECT ALL THAT APPLY \n\n1. Just making ends meet day to day\n2. Paying off my debts/reducing debts\n3. Saving money to rent own home\n4. Saving money to buy own home\n5. Saving money for a wedding\n6. Saving money to start a family/have another child\n7. Saving money  for education for me <IF CODE 2 AT A6 and my partner/spouse>\n8. Saving money  for education for children/grown-up children\n9. Saving money  to help grown-up children to rent a home\n10. Saving money  to help grown-up children to buy a home\n11. Saving money for a holiday\n12. Saving money for retirement\n13. Saving money for home improvements\n14. Saving money to purchase a car/van/motorbike\n15. Saving money generally\n16. Other (please specify)\n17. None of these \n\nB) How much of a plan do you have about how you will achieve these goals\nPlease answer on a scale of 0 to 10, where 0 means you don’t have a plan of what you need to do and 10 means you have a very specific plan of what you need to do…\n\n0 I don’t have a plan of what I need to do, I just know I want to do it\n2. 1\n3. 2\n4. 3\n5. 4\n6. 5\n7. 6\n8. 7\n9. 8\n10. 9\n11. 10 I have a very specific plan of what I need to do\n12. Don’t know",null,null,null,null,{"$f":"IFERROR(INDEX(F$3:F$281,SMALL(IF(B$3:B$281=\"In\",ROW(F$2:F$280)-ROW(F$2)+1),ROW(F54))),\"\")","v":""},{"$f":"IFERROR(INDEX(D$3:D$281,SMALL(IF(B$3:B$281=\"In\",ROW(D$2:D$280)-ROW(F$2)+1),ROW(F54))),\"\")","v":""},{"$f":"IFERROR(INDEX(E$3:E$281,SMALL(IF(B$3:B$281=\"In\",ROW(E$2:E$280)-ROW(E$2)+1),ROW(E54))),\"\")","v":""},{"$f":"IFERROR(INDEX(G$3:G$281,SMALL(IF(B$3:B$281=\"In\",ROW(F$2:F$280)-ROW(F$2)+1),ROW(F54))),\"\")","v":""},{"$f":"IFERROR(INDEX(H$3:H$281,SMALL(IF(B$3:B$281=\"In\",ROW(H$2:H$280)-ROW(G$2)+1),ROW(G54))),\"\")","v":""},{"$f":"IFERROR(INDEX(I$3:I$281,SMALL(IF(B$3:B$281=\"In\",ROW(I$2:I$280)-ROW(H$2)+1),ROW(H54))),\"\")","v":""},{"$f":"IFERROR(INDEX(J$3:J$281,SMALL(IF(B$3:B$281=\"In\",ROW(J$2:J$280)-ROW(I$2)+1),ROW(I54))),\"\")","v":""},{"$f":"IFERROR(INDEX(K$3:K$281,SMALL(IF(B$3:B$281=\"In\",ROW(K$2:K$280)-ROW(J$2)+1),ROW(J54))),\"\")","v":""},{"$f":"IFERROR(INDEX(L$3:L$281,SMALL(IF(B$3:B$281=\"In\",ROW(L$2:L$280)-ROW(K$2)+1),ROW(K54))),\"\")","v":""}]
[false,"Out","PAFLE","Behaviours","Y",55,"Working towards financial goals ",null,"How much thought about financial goals generally","FinCap 2018 D4a","PRE. Before today, how much have you thought about financial goals for the next five years?\n\n1. Great deal\n2. Fair amount\n3. Not very much\n4. Not at all\n5. Don’t know\n\nPOST. Since [REFERENCE POINT] how much have you thought about financial goals for the next five years?\n\n1. Great deal\n2. Fair amount\n3. Not very much\n4. Not at all\n5. Don’t know",null,null,null,null,{"$f":"IFERROR(INDEX(F$3:F$281,SMALL(IF(B$3:B$281=\"In\",ROW(F$2:F$280)-ROW(F$2)+1),ROW(F55))),\"\")","v":""},{"$f":"IFERROR(INDEX(D$3:D$281,SMALL(IF(B$3:B$281=\"In\",ROW(D$2:D$280)-ROW(F$2)+1),ROW(F55))),\"\")","v":""},{"$f":"IFERROR(INDEX(E$3:E$281,SMALL(IF(B$3:B$281=\"In\",ROW(E$2:E$280)-ROW(E$2)+1),ROW(E55))),\"\")","v":""},{"$f":"IFERROR(INDEX(G$3:G$281,SMALL(IF(B$3:B$281=\"In\",ROW(F$2:F$280)-ROW(F$2)+1),ROW(F55))),\"\")","v":""},{"$f":"IFERROR(INDEX(H$3:H$281,SMALL(IF(B$3:B$281=\"In\",ROW(H$2:H$280)-ROW(G$2)+1),ROW(G55))),\"\")","v":""},{"$f":"IFERROR(INDEX(I$3:I$281,SMALL(IF(B$3:B$281=\"In\",ROW(I$2:I$280)-ROW(H$2)+1),ROW(H55))),\"\")","v":""},{"$f":"IFERROR(INDEX(J$3:J$281,SMALL(IF(B$3:B$281=\"In\",ROW(J$2:J$280)-ROW(I$2)+1),ROW(I55))),\"\")","v":""},{"$f":"IFERROR(INDEX(K$3:K$281,SMALL(IF(B$3:B$281=\"In\",ROW(K$2:K$280)-ROW(J$2)+1),ROW(J55))),\"\")","v":""},{"$f":"IFERROR(INDEX(L$3:L$281,SMALL(IF(B$3:B$281=\"In\",ROW(L$2:L$280)-ROW(K$2)+1),ROW(K55))),\"\")","v":""}]
[false,"Out","PAFLE","Behaviours","Y",56,"Working towards financial goals ",null,"How much of a plan for financial goals generally","FinCap 2018 D5a","Thinking more generally about financial goals you might have for the next five years, how much of a plan do you have for Financial goals for the next five years \n\n1. Clear plan \n2. Rough plan \n3. Not much of a plan \n4. No plan at all \n5. I do not have any financial goals for the next five years \n6. Don’t know",null,null,null,null,{"$f":"IFERROR(INDEX(F$3:F$281,SMALL(IF(B$3:B$281=\"In\",ROW(F$2:F$280)-ROW(F$2)+1),ROW(F56))),\"\")","v":""},{"$f":"IFERROR(INDEX(D$3:D$281,SMALL(IF(B$3:B$281=\"In\",ROW(D$2:D$280)-ROW(F$2)+1),ROW(F56))),\"\")","v":""},{"$f":"IFERROR(INDEX(E$3:E$281,SMALL(IF(B$3:B$281=\"In\",ROW(E$2:E$280)-ROW(E$2)+1),ROW(E56))),\"\")","v":""},{"$f":"IFERROR(INDEX(G$3:G$281,SMALL(IF(B$3:B$281=\"In\",ROW(F$2:F$280)-ROW(F$2)+1),ROW(F56))),\"\")","v":""},{"$f":"IFERROR(INDEX(H$3:H$281,SMALL(IF(B$3:B$281=\"In\",ROW(H$2:H$280)-ROW(G$2)+1),ROW(G56))),\"\")","v":""},{"$f":"IFERROR(INDEX(I$3:I$281,SMALL(IF(B$3:B$281=\"In\",ROW(I$2:I$280)-ROW(H$2)+1),ROW(H56))),\"\")","v":""},{"$f":"IFERROR(INDEX(J$3:J$281,SMALL(IF(B$3:B$281=\"In\",ROW(J$2:J$280)-ROW(I$2)+1),ROW(I56))),\"\")","v":""},{"$f":"IFERROR(INDEX(K$3:K$281,SMALL(IF(B$3:B$281=\"In\",ROW(K$2:K$280)-ROW(J$2)+1),ROW(J56))),\"\")","v":""},{"$f":"IFERROR(INDEX(L$3:L$281,SMALL(IF(B$3:B$281=\"In\",ROW(L$2:L$280)-ROW(K$2)+1),ROW(K56))),\"\")","v":""}]
[false,"Out","PAFLE","Behaviours","N",57,"Planning for retirement",null,"Whether currently paying into a pension scheme ","Fincap H1","Are you currently paying into one or more pensions? This can include an employer or any other type of private pension\nCHOOSE ONE ONLY\n\n1. Yes\n2. No\n3. I am retired so I am not paying into a pension\n4. Don’t know",null,null,null,null,{"$f":"IFERROR(INDEX(F$3:F$281,SMALL(IF(B$3:B$281=\"In\",ROW(F$2:F$280)-ROW(F$2)+1),ROW(F57))),\"\")","v":""},{"$f":"IFERROR(INDEX(D$3:D$281,SMALL(IF(B$3:B$281=\"In\",ROW(D$2:D$280)-ROW(F$2)+1),ROW(F57))),\"\")","v":""},{"$f":"IFERROR(INDEX(E$3:E$281,SMALL(IF(B$3:B$281=\"In\",ROW(E$2:E$280)-ROW(E$2)+1),ROW(E57))),\"\")","v":""},{"$f":"IFERROR(INDEX(G$3:G$281,SMALL(IF(B$3:B$281=\"In\",ROW(F$2:F$280)-ROW(F$2)+1),ROW(F57))),\"\")","v":""},{"$f":"IFERROR(INDEX(H$3:H$281,SMALL(IF(B$3:B$281=\"In\",ROW(H$2:H$280)-ROW(G$2)+1),ROW(G57))),\"\")","v":""},{"$f":"IFERROR(INDEX(I$3:I$281,SMALL(IF(B$3:B$281=\"In\",ROW(I$2:I$280)-ROW(H$2)+1),ROW(H57))),\"\")","v":""},{"$f":"IFERROR(INDEX(J$3:J$281,SMALL(IF(B$3:B$281=\"In\",ROW(J$2:J$280)-ROW(I$2)+1),ROW(I57))),\"\")","v":""},{"$f":"IFERROR(INDEX(K$3:K$281,SMALL(IF(B$3:B$281=\"In\",ROW(K$2:K$280)-ROW(J$2)+1),ROW(J57))),\"\")","v":""},{"$f":"IFERROR(INDEX(L$3:L$281,SMALL(IF(B$3:B$281=\"In\",ROW(L$2:L$280)-ROW(K$2)+1),ROW(K57))),\"\")","v":""}]
[false,"Out","PAFLE","Behaviours","N",58,"Planning for retirement",null,"Steps taken to ensure adequate income (for pension or retirement)","NEW","PRE. In the last [X] months, which of the following have you done in relation to your pension or retirement income?\n\nPOST. Since [REFERENCE POINT], which of the following have you done in relation to your pension or retirement income? \nCHOOSE ALL THAT APPLY\n\n1. Checked whether my income will be enough to meet my needs in retirement\n2. Increased how much I am paying towards my retirement income\n3. I don't have a pension / source of retirement income\n4. Neither of these\n",null,null,null,null,{"$f":"IFERROR(INDEX(F$3:F$281,SMALL(IF(B$3:B$281=\"In\",ROW(F$2:F$280)-ROW(F$2)+1),ROW(F58))),\"\")","v":""},{"$f":"IFERROR(INDEX(D$3:D$281,SMALL(IF(B$3:B$281=\"In\",ROW(D$2:D$280)-ROW(F$2)+1),ROW(F58))),\"\")","v":""},{"$f":"IFERROR(INDEX(E$3:E$281,SMALL(IF(B$3:B$281=\"In\",ROW(E$2:E$280)-ROW(E$2)+1),ROW(E58))),\"\")","v":""},{"$f":"IFERROR(INDEX(G$3:G$281,SMALL(IF(B$3:B$281=\"In\",ROW(F$2:F$280)-ROW(F$2)+1),ROW(F58))),\"\")","v":""},{"$f":"IFERROR(INDEX(H$3:H$281,SMALL(IF(B$3:B$281=\"In\",ROW(H$2:H$280)-ROW(G$2)+1),ROW(G58))),\"\")","v":""},{"$f":"IFERROR(INDEX(I$3:I$281,SMALL(IF(B$3:B$281=\"In\",ROW(I$2:I$280)-ROW(H$2)+1),ROW(H58))),\"\")","v":""},{"$f":"IFERROR(INDEX(J$3:J$281,SMALL(IF(B$3:B$281=\"In\",ROW(J$2:J$280)-ROW(I$2)+1),ROW(I58))),\"\")","v":""},{"$f":"IFERROR(INDEX(K$3:K$281,SMALL(IF(B$3:B$281=\"In\",ROW(K$2:K$280)-ROW(J$2)+1),ROW(J58))),\"\")","v":""},{"$f":"IFERROR(INDEX(L$3:L$281,SMALL(IF(B$3:B$281=\"In\",ROW(L$2:L$280)-ROW(K$2)+1),ROW(K58))),\"\")","v":""}]
[false,"Out","PAFLE","Behaviours","Y",59,"Planning for retirement",null,"How much done to plan for finances in retirement","FinCap 2018 D7c","How much have you done to plan your finances for retirement\n\n1. Great deal\n2. Fair amount\n3. Not very much\n4. Nothing at all\n5. Don’t know",null,null,null,null,{"$f":"IFERROR(INDEX(F$3:F$281,SMALL(IF(B$3:B$281=\"In\",ROW(F$2:F$280)-ROW(F$2)+1),ROW(F59))),\"\")","v":""},{"$f":"IFERROR(INDEX(D$3:D$281,SMALL(IF(B$3:B$281=\"In\",ROW(D$2:D$280)-ROW(F$2)+1),ROW(F59))),\"\")","v":""},{"$f":"IFERROR(INDEX(E$3:E$281,SMALL(IF(B$3:B$281=\"In\",ROW(E$2:E$280)-ROW(E$2)+1),ROW(E59))),\"\")","v":""},{"$f":"IFERROR(INDEX(G$3:G$281,SMALL(IF(B$3:B$281=\"In\",ROW(F$2:F$280)-ROW(F$2)+1),ROW(F59))),\"\")","v":""},{"$f":"IFERROR(INDEX(H$3:H$281,SMALL(IF(B$3:B$281=\"In\",ROW(H$2:H$280)-ROW(G$2)+1),ROW(G59))),\"\")","v":""},{"$f":"IFERROR(INDEX(I$3:I$281,SMALL(IF(B$3:B$281=\"In\",ROW(I$2:I$280)-ROW(H$2)+1),ROW(H59))),\"\")","v":""},{"$f":"IFERROR(INDEX(J$3:J$281,SMALL(IF(B$3:B$281=\"In\",ROW(J$2:J$280)-ROW(I$2)+1),ROW(I59))),\"\")","v":""},{"$f":"IFERROR(INDEX(K$3:K$281,SMALL(IF(B$3:B$281=\"In\",ROW(K$2:K$280)-ROW(J$2)+1),ROW(J59))),\"\")","v":""},{"$f":"IFERROR(INDEX(L$3:L$281,SMALL(IF(B$3:B$281=\"In\",ROW(L$2:L$280)-ROW(K$2)+1),ROW(K59))),\"\")","v":""}]
[false,"Out","PAFLE","Behaviours","Y",60,"Planning for retirement",null,"How much of a plan for finances in retirement","FinCap 2018 D5C","How much of a plan do you have for your finances in retirement \n\n1. Clear plan \n2. Rough plan \n3. Not much of a plan \n4. No plan at all \n5. Don’t know",null,null,null,null,{"$f":"IFERROR(INDEX(F$3:F$281,SMALL(IF(B$3:B$281=\"In\",ROW(F$2:F$280)-ROW(F$2)+1),ROW(F60))),\"\")","v":""},{"$f":"IFERROR(INDEX(D$3:D$281,SMALL(IF(B$3:B$281=\"In\",ROW(D$2:D$280)-ROW(F$2)+1),ROW(F60))),\"\")","v":""},{"$f":"IFERROR(INDEX(E$3:E$281,SMALL(IF(B$3:B$281=\"In\",ROW(E$2:E$280)-ROW(E$2)+1),ROW(E60))),\"\")","v":""},{"$f":"IFERROR(INDEX(G$3:G$281,SMALL(IF(B$3:B$281=\"In\",ROW(F$2:F$280)-ROW(F$2)+1),ROW(F60))),\"\")","v":""},{"$f":"IFERROR(INDEX(H$3:H$281,SMALL(IF(B$3:B$281=\"In\",ROW(H$2:H$280)-ROW(G$2)+1),ROW(G60))),\"\")","v":""},{"$f":"IFERROR(INDEX(I$3:I$281,SMALL(IF(B$3:B$281=\"In\",ROW(I$2:I$280)-ROW(H$2)+1),ROW(H60))),\"\")","v":""},{"$f":"IFERROR(INDEX(J$3:J$281,SMALL(IF(B$3:B$281=\"In\",ROW(J$2:J$280)-ROW(I$2)+1),ROW(I60))),\"\")","v":""},{"$f":"IFERROR(INDEX(K$3:K$281,SMALL(IF(B$3:B$281=\"In\",ROW(K$2:K$280)-ROW(J$2)+1),ROW(J60))),\"\")","v":""},{"$f":"IFERROR(INDEX(L$3:L$281,SMALL(IF(B$3:B$281=\"In\",ROW(L$2:L$280)-ROW(K$2)+1),ROW(K60))),\"\")","v":""}]
[false,"Out","PAFLE","Behaviours","Y",61,"Planning for retirement",null,"Actions taken to monitor/improve pension provision","FinCap 2018 D9C","PRE. Over the last 12 months have you done any of these? \n\n1. Logged into an online pension account to look at my pension \n2. Read key details of an annual statement or information sent by pension provider \n3. Contacted pension provider \n4. Spoken to a regulated financial adviser (IFA) about retirement planning \n5. Contacted PensionWise or The Pensions Advisory Service (TPAS) \n6. Other – please specify \n7. None of these \n8. Don’t know\n\nPOST. Since [REFERENCE POINT] have you done any of these?\n\n1. Logged into an online pension account to look at my pension \n2. Read key details of an annual statement or information sent by pension provider \n3. Contacted pension provider \n4. Spoken to a regulated financial adviser (IFA) about retirement planning \n5. Contacted PensionWise or The Pensions Advisory Service (TPAS) \n6. Other – please specify \n7. None of these \n8. Don’t know",null,null,null,null,{"$f":"IFERROR(INDEX(F$3:F$281,SMALL(IF(B$3:B$281=\"In\",ROW(F$2:F$280)-ROW(F$2)+1),ROW(F61))),\"\")","v":""},{"$f":"IFERROR(INDEX(D$3:D$281,SMALL(IF(B$3:B$281=\"In\",ROW(D$2:D$280)-ROW(F$2)+1),ROW(F61))),\"\")","v":""},{"$f":"IFERROR(INDEX(E$3:E$281,SMALL(IF(B$3:B$281=\"In\",ROW(E$2:E$280)-ROW(E$2)+1),ROW(E61))),\"\")","v":""},{"$f":"IFERROR(INDEX(G$3:G$281,SMALL(IF(B$3:B$281=\"In\",ROW(F$2:F$280)-ROW(F$2)+1),ROW(F61))),\"\")","v":""},{"$f":"IFERROR(INDEX(H$3:H$281,SMALL(IF(B$3:B$281=\"In\",ROW(H$2:H$280)-ROW(G$2)+1),ROW(G61))),\"\")","v":""},{"$f":"IFERROR(INDEX(I$3:I$281,SMALL(IF(B$3:B$281=\"In\",ROW(I$2:I$280)-ROW(H$2)+1),ROW(H61))),\"\")","v":""},{"$f":"IFERROR(INDEX(J$3:J$281,SMALL(IF(B$3:B$281=\"In\",ROW(J$2:J$280)-ROW(I$2)+1),ROW(I61))),\"\")","v":""},{"$f":"IFERROR(INDEX(K$3:K$281,SMALL(IF(B$3:B$281=\"In\",ROW(K$2:K$280)-ROW(J$2)+1),ROW(J61))),\"\")","v":""},{"$f":"IFERROR(INDEX(L$3:L$281,SMALL(IF(B$3:B$281=\"In\",ROW(L$2:L$280)-ROW(K$2)+1),ROW(K61))),\"\")","v":""}]
[false,"Out","PSA","Behaviours","N",62,"Proactively seeking advice and guidance "," ","How recently guidance and advice has been used","WAS DBurdW","PRE: In the last [SIX] months, which of these have you used for information or advice about your finances?\nPOST: Since [REFERENCE POINT] which of these have you used for information or advice about your finances?\nCHOOSE ALL THAT APPLY\n1. A free advice agency (Money Advice Service, Citizens Advice Bureau, money or debt advice centre, law centre, consumer credit counselling service, National Debtline, benefits office)\n2. An insolvency practitioner\n3. Accountant, bank or other financial adviser\n4. Solicitor or lawyer\n5. Other advice company or person charging a fee\n6. Landlord\n7. Family or friends\n8. Martin Lewis/Money Saving Expert\n9. Price comparison websites e.g. moneysupermarket.com\n10. Other websites\n11. Other (specify)\n12. I haven’t used any of these for advice\n",null,null,null,null,{"$f":"IFERROR(INDEX(F$3:F$281,SMALL(IF(B$3:B$281=\"In\",ROW(F$2:F$280)-ROW(F$2)+1),ROW(F62))),\"\")","v":""},{"$f":"IFERROR(INDEX(D$3:D$281,SMALL(IF(B$3:B$281=\"In\",ROW(D$2:D$280)-ROW(F$2)+1),ROW(F62))),\"\")","v":""},{"$f":"IFERROR(INDEX(E$3:E$281,SMALL(IF(B$3:B$281=\"In\",ROW(E$2:E$280)-ROW(E$2)+1),ROW(E62))),\"\")","v":""},{"$f":"IFERROR(INDEX(G$3:G$281,SMALL(IF(B$3:B$281=\"In\",ROW(F$2:F$280)-ROW(F$2)+1),ROW(F62))),\"\")","v":""},{"$f":"IFERROR(INDEX(H$3:H$281,SMALL(IF(B$3:B$281=\"In\",ROW(H$2:H$280)-ROW(G$2)+1),ROW(G62))),\"\")","v":""},{"$f":"IFERROR(INDEX(I$3:I$281,SMALL(IF(B$3:B$281=\"In\",ROW(I$2:I$280)-ROW(H$2)+1),ROW(H62))),\"\")","v":""},{"$f":"IFERROR(INDEX(J$3:J$281,SMALL(IF(B$3:B$281=\"In\",ROW(J$2:J$280)-ROW(I$2)+1),ROW(I62))),\"\")","v":""},{"$f":"IFERROR(INDEX(K$3:K$281,SMALL(IF(B$3:B$281=\"In\",ROW(K$2:K$280)-ROW(J$2)+1),ROW(J62))),\"\")","v":""},{"$f":"IFERROR(INDEX(L$3:L$281,SMALL(IF(B$3:B$281=\"In\",ROW(L$2:L$280)-ROW(K$2)+1),ROW(K62))),\"\")","v":""}]
[false,"Out","PSA","Behaviours","N ",63,"Proactively seeking online advice and guidance"," ","How frequently online advice and guidance has been sought","DSK 2.1","How often in the last [THREE MONTHS] have you gone online for the following purposes?\n\n- For information or advice on a financial product you needed or wanted\n- To find out whether a financial product was suitable for you\n- To compare financial products to find the best deal for you\n\nCHOOSE ONE FOR EACH\n1. Every day\n2. Every week\n3. Every few weeks\n4. Never \n5. Don’t know",null,null,null,null,{"$f":"IFERROR(INDEX(F$3:F$281,SMALL(IF(B$3:B$281=\"In\",ROW(F$2:F$280)-ROW(F$2)+1),ROW(F63))),\"\")","v":""},{"$f":"IFERROR(INDEX(D$3:D$281,SMALL(IF(B$3:B$281=\"In\",ROW(D$2:D$280)-ROW(F$2)+1),ROW(F63))),\"\")","v":""},{"$f":"IFERROR(INDEX(E$3:E$281,SMALL(IF(B$3:B$281=\"In\",ROW(E$2:E$280)-ROW(E$2)+1),ROW(E63))),\"\")","v":""},{"$f":"IFERROR(INDEX(G$3:G$281,SMALL(IF(B$3:B$281=\"In\",ROW(F$2:F$280)-ROW(F$2)+1),ROW(F63))),\"\")","v":""},{"$f":"IFERROR(INDEX(H$3:H$281,SMALL(IF(B$3:B$281=\"In\",ROW(H$2:H$280)-ROW(G$2)+1),ROW(G63))),\"\")","v":""},{"$f":"IFERROR(INDEX(I$3:I$281,SMALL(IF(B$3:B$281=\"In\",ROW(I$2:I$280)-ROW(H$2)+1),ROW(H63))),\"\")","v":""},{"$f":"IFERROR(INDEX(J$3:J$281,SMALL(IF(B$3:B$281=\"In\",ROW(J$2:J$280)-ROW(I$2)+1),ROW(I63))),\"\")","v":""},{"$f":"IFERROR(INDEX(K$3:K$281,SMALL(IF(B$3:B$281=\"In\",ROW(K$2:K$280)-ROW(J$2)+1),ROW(J63))),\"\")","v":""},{"$f":"IFERROR(INDEX(L$3:L$281,SMALL(IF(B$3:B$281=\"In\",ROW(L$2:L$280)-ROW(K$2)+1),ROW(K63))),\"\")","v":""}]
[false,"Out","ATAG","Connection","N",64,"Exposure and access to appropriate financial advice and guidance","Access to financial advice, guidance and tools which meet their needs in a form and language they can understand, and channel they can use effectively","Ease of access to advice services, either in person or by telephone ","ELSA SC5 and SEG C6","How easy or difficult is it for you to do each of the following things?\nCHOOSE ONE ONLY FOR EACH\n-Get to a Citizens Advice Bureau or other advice agency using your normal forms of transport\n-Get to a Jobcentre Plus or local benefit office using your normal forms of transport\n-Use a telephone in private to discuss financial matters\n-Receive confidential financial information by post\n\n1.Very easy\n2.Quite easy\n3.Quite difficult\n4.Very difficult\n5.Unable to go\n6.Do not wish to go",null,null,null,null,{"$f":"IFERROR(INDEX(F$3:F$281,SMALL(IF(B$3:B$281=\"In\",ROW(F$2:F$280)-ROW(F$2)+1),ROW(F64))),\"\")","v":""},{"$f":"IFERROR(INDEX(D$3:D$281,SMALL(IF(B$3:B$281=\"In\",ROW(D$2:D$280)-ROW(F$2)+1),ROW(F64))),\"\")","v":""},{"$f":"IFERROR(INDEX(E$3:E$281,SMALL(IF(B$3:B$281=\"In\",ROW(E$2:E$280)-ROW(E$2)+1),ROW(E64))),\"\")","v":""},{"$f":"IFERROR(INDEX(G$3:G$281,SMALL(IF(B$3:B$281=\"In\",ROW(F$2:F$280)-ROW(F$2)+1),ROW(F64))),\"\")","v":""},{"$f":"IFERROR(INDEX(H$3:H$281,SMALL(IF(B$3:B$281=\"In\",ROW(H$2:H$280)-ROW(G$2)+1),ROW(G64))),\"\")","v":""},{"$f":"IFERROR(INDEX(I$3:I$281,SMALL(IF(B$3:B$281=\"In\",ROW(I$2:I$280)-ROW(H$2)+1),ROW(H64))),\"\")","v":""},{"$f":"IFERROR(INDEX(J$3:J$281,SMALL(IF(B$3:B$281=\"In\",ROW(J$2:J$280)-ROW(I$2)+1),ROW(I64))),\"\")","v":""},{"$f":"IFERROR(INDEX(K$3:K$281,SMALL(IF(B$3:B$281=\"In\",ROW(K$2:K$280)-ROW(J$2)+1),ROW(J64))),\"\")","v":""},{"$f":"IFERROR(INDEX(L$3:L$281,SMALL(IF(B$3:B$281=\"In\",ROW(L$2:L$280)-ROW(K$2)+1),ROW(K64))),\"\")","v":""}]
[false,"Out","ATFP","Connection","N",65,"Exposure and access to financial products ","Access to appropriate financial products which meet their needs via appropriate channels","Ease of access to banking services, either in person or my mail","ELSA SC5 and SEG C6","How easy or difficult is it for you to do each of the folllowing things?\nCHOOSE ONE ONLY FOR EACH\n- Get to a Post Office using your normal forms of transport\n- Get to a Cash point using your normal forms of transport\n- Get to a Bank, building society or credit union using your normal forms of transport\n- Receive confidential financial documents by post, such as a payment card or chequebook\n\n1.Very easy\n2.Quite easy\n3.Quite difficult\n4.Very difficult\n5.Unable to go\n6.Do not wish to go",null,null,null,null,{"$f":"IFERROR(INDEX(F$3:F$281,SMALL(IF(B$3:B$281=\"In\",ROW(F$2:F$280)-ROW(F$2)+1),ROW(F65))),\"\")","v":""},{"$f":"IFERROR(INDEX(D$3:D$281,SMALL(IF(B$3:B$281=\"In\",ROW(D$2:D$280)-ROW(F$2)+1),ROW(F65))),\"\")","v":""},{"$f":"IFERROR(INDEX(E$3:E$281,SMALL(IF(B$3:B$281=\"In\",ROW(E$2:E$280)-ROW(E$2)+1),ROW(E65))),\"\")","v":""},{"$f":"IFERROR(INDEX(G$3:G$281,SMALL(IF(B$3:B$281=\"In\",ROW(F$2:F$280)-ROW(F$2)+1),ROW(F65))),\"\")","v":""},{"$f":"IFERROR(INDEX(H$3:H$281,SMALL(IF(B$3:B$281=\"In\",ROW(H$2:H$280)-ROW(G$2)+1),ROW(G65))),\"\")","v":""},{"$f":"IFERROR(INDEX(I$3:I$281,SMALL(IF(B$3:B$281=\"In\",ROW(I$2:I$280)-ROW(H$2)+1),ROW(H65))),\"\")","v":""},{"$f":"IFERROR(INDEX(J$3:J$281,SMALL(IF(B$3:B$281=\"In\",ROW(J$2:J$280)-ROW(I$2)+1),ROW(I65))),\"\")","v":""},{"$f":"IFERROR(INDEX(K$3:K$281,SMALL(IF(B$3:B$281=\"In\",ROW(K$2:K$280)-ROW(J$2)+1),ROW(J65))),\"\")","v":""},{"$f":"IFERROR(INDEX(L$3:L$281,SMALL(IF(B$3:B$281=\"In\",ROW(L$2:L$280)-ROW(K$2)+1),ROW(K65))),\"\")","v":""}]
[false,"Out","ATFP","Connection","N",66,"Exposure and access to financial products ","Access to appropriate financial products which meet their needs via appropriate channels","Types of banking products held","FRS Showcard N1","Which of the following types of everyday accounts do you have, if any, either in your own name or jointly with someone else? These might be held with a bank, building society or other provider such as a credit union or post office. \nCHOOSE ALL THAT APPLY\n1. Current account (usually offered with an overdraft facility, even if you don't want one)\n2. Basic Bank Account (normally without an overdraft facility)\n3. Post Office Card Account (for receiving your pension, benefits or tax credits) \n4. A saving deposit account (e.g. an instant access or notice account, including cash ISA)\n5. None of these",null,null,null,null,{"$f":"IFERROR(INDEX(F$3:F$281,SMALL(IF(B$3:B$281=\"In\",ROW(F$2:F$280)-ROW(F$2)+1),ROW(F66))),\"\")","v":""},{"$f":"IFERROR(INDEX(D$3:D$281,SMALL(IF(B$3:B$281=\"In\",ROW(D$2:D$280)-ROW(F$2)+1),ROW(F66))),\"\")","v":""},{"$f":"IFERROR(INDEX(E$3:E$281,SMALL(IF(B$3:B$281=\"In\",ROW(E$2:E$280)-ROW(E$2)+1),ROW(E66))),\"\")","v":""},{"$f":"IFERROR(INDEX(G$3:G$281,SMALL(IF(B$3:B$281=\"In\",ROW(F$2:F$280)-ROW(F$2)+1),ROW(F66))),\"\")","v":""},{"$f":"IFERROR(INDEX(H$3:H$281,SMALL(IF(B$3:B$281=\"In\",ROW(H$2:H$280)-ROW(G$2)+1),ROW(G66))),\"\")","v":""},{"$f":"IFERROR(INDEX(I$3:I$281,SMALL(IF(B$3:B$281=\"In\",ROW(I$2:I$280)-ROW(H$2)+1),ROW(H66))),\"\")","v":""},{"$f":"IFERROR(INDEX(J$3:J$281,SMALL(IF(B$3:B$281=\"In\",ROW(J$2:J$280)-ROW(I$2)+1),ROW(I66))),\"\")","v":""},{"$f":"IFERROR(INDEX(K$3:K$281,SMALL(IF(B$3:B$281=\"In\",ROW(K$2:K$280)-ROW(J$2)+1),ROW(J66))),\"\")","v":""},{"$f":"IFERROR(INDEX(L$3:L$281,SMALL(IF(B$3:B$281=\"In\",ROW(L$2:L$280)-ROW(K$2)+1),ROW(K66))),\"\")","v":""}]
[false,"Out","ATAG","Connection","N",67,"Exposure and access to appropriate financial advice and guidance","Digital access to financial advice, guidance and tools ","Use of the internet to access information about money and finances ","NEW","In which of the following ways, if any, can or do you use the internet when you need to access information about money or your finances?\nCHOOSE ALL THAT APPLY\n1. At home, using a computer or laptop\n2. At home, using a mobile phone, tablet or internet-enabled TV\n3. At work, college or at a friend or relative's home\n4. In a library, community centre or other public setting\n5. Somewhere else\n6. Do not use the internet",null,null,null,null,{"$f":"IFERROR(INDEX(F$3:F$281,SMALL(IF(B$3:B$281=\"In\",ROW(F$2:F$280)-ROW(F$2)+1),ROW(F67))),\"\")","v":""},{"$f":"IFERROR(INDEX(D$3:D$281,SMALL(IF(B$3:B$281=\"In\",ROW(D$2:D$280)-ROW(F$2)+1),ROW(F67))),\"\")","v":""},{"$f":"IFERROR(INDEX(E$3:E$281,SMALL(IF(B$3:B$281=\"In\",ROW(E$2:E$280)-ROW(E$2)+1),ROW(E67))),\"\")","v":""},{"$f":"IFERROR(INDEX(G$3:G$281,SMALL(IF(B$3:B$281=\"In\",ROW(F$2:F$280)-ROW(F$2)+1),ROW(F67))),\"\")","v":""},{"$f":"IFERROR(INDEX(H$3:H$281,SMALL(IF(B$3:B$281=\"In\",ROW(H$2:H$280)-ROW(G$2)+1),ROW(G67))),\"\")","v":""},{"$f":"IFERROR(INDEX(I$3:I$281,SMALL(IF(B$3:B$281=\"In\",ROW(I$2:I$280)-ROW(H$2)+1),ROW(H67))),\"\")","v":""},{"$f":"IFERROR(INDEX(J$3:J$281,SMALL(IF(B$3:B$281=\"In\",ROW(J$2:J$280)-ROW(I$2)+1),ROW(I67))),\"\")","v":""},{"$f":"IFERROR(INDEX(K$3:K$281,SMALL(IF(B$3:B$281=\"In\",ROW(K$2:K$280)-ROW(J$2)+1),ROW(J67))),\"\")","v":""},{"$f":"IFERROR(INDEX(L$3:L$281,SMALL(IF(B$3:B$281=\"In\",ROW(L$2:L$280)-ROW(K$2)+1),ROW(K67))),\"\")","v":""}]
[false,"Out","DE","Mindset","Y",68,"Digital engagement","Digital access to financial products and services ","Willingness to use the internet to carry out day to day banking","O2G","To what extent do you agree or disagree with the following statement: I would be happy to use the Internet to carry out day to day banking transactions\n\n1. Strongly agree\n2. Tend to agree\n3. Neither agree nor disagree\n4. Tend to disagree\n5. Strongly disagree\n6. Don’t know",null,null,null,null,{"$f":"IFERROR(INDEX(F$3:F$281,SMALL(IF(B$3:B$281=\"In\",ROW(F$2:F$280)-ROW(F$2)+1),ROW(F68))),\"\")","v":""},{"$f":"IFERROR(INDEX(D$3:D$281,SMALL(IF(B$3:B$281=\"In\",ROW(D$2:D$280)-ROW(F$2)+1),ROW(F68))),\"\")","v":""},{"$f":"IFERROR(INDEX(E$3:E$281,SMALL(IF(B$3:B$281=\"In\",ROW(E$2:E$280)-ROW(E$2)+1),ROW(E68))),\"\")","v":""},{"$f":"IFERROR(INDEX(G$3:G$281,SMALL(IF(B$3:B$281=\"In\",ROW(F$2:F$280)-ROW(F$2)+1),ROW(F68))),\"\")","v":""},{"$f":"IFERROR(INDEX(H$3:H$281,SMALL(IF(B$3:B$281=\"In\",ROW(H$2:H$280)-ROW(G$2)+1),ROW(G68))),\"\")","v":""},{"$f":"IFERROR(INDEX(I$3:I$281,SMALL(IF(B$3:B$281=\"In\",ROW(I$2:I$280)-ROW(H$2)+1),ROW(H68))),\"\")","v":""},{"$f":"IFERROR(INDEX(J$3:J$281,SMALL(IF(B$3:B$281=\"In\",ROW(J$2:J$280)-ROW(I$2)+1),ROW(I68))),\"\")","v":""},{"$f":"IFERROR(INDEX(K$3:K$281,SMALL(IF(B$3:B$281=\"In\",ROW(K$2:K$280)-ROW(J$2)+1),ROW(J68))),\"\")","v":""},{"$f":"IFERROR(INDEX(L$3:L$281,SMALL(IF(B$3:B$281=\"In\",ROW(L$2:L$280)-ROW(K$2)+1),ROW(K68))),\"\")","v":""}]
[false,"Out","DE","Mindset","Y",69,"Digital engagement",null,"Breadth of internet use ","FinCap 2018 CRINTQ1","Which, if any, of these do you ever use the internet for - using any type of device including a laptop or desktop computer, a mobile phone or a tablet?  \n\n1. Online shopping (purchasing goods/ services / tickets etc.) or online trading/ auctions (e.g. eBay) \n2. Online/mobile banking \n3. Finding/ downloading information for work/ business/ school/ college/ university \n4. Accessing news \n5. Using social networking (such as Facebook, Twitter, Instagram, Snapchat, LinkedIn) \n6. None of these",null,null,null,null,{"$f":"IFERROR(INDEX(F$3:F$281,SMALL(IF(B$3:B$281=\"In\",ROW(F$2:F$280)-ROW(F$2)+1),ROW(F69))),\"\")","v":""},{"$f":"IFERROR(INDEX(D$3:D$281,SMALL(IF(B$3:B$281=\"In\",ROW(D$2:D$280)-ROW(F$2)+1),ROW(F69))),\"\")","v":""},{"$f":"IFERROR(INDEX(E$3:E$281,SMALL(IF(B$3:B$281=\"In\",ROW(E$2:E$280)-ROW(E$2)+1),ROW(E69))),\"\")","v":""},{"$f":"IFERROR(INDEX(G$3:G$281,SMALL(IF(B$3:B$281=\"In\",ROW(F$2:F$280)-ROW(F$2)+1),ROW(F69))),\"\")","v":""},{"$f":"IFERROR(INDEX(H$3:H$281,SMALL(IF(B$3:B$281=\"In\",ROW(H$2:H$280)-ROW(G$2)+1),ROW(G69))),\"\")","v":""},{"$f":"IFERROR(INDEX(I$3:I$281,SMALL(IF(B$3:B$281=\"In\",ROW(I$2:I$280)-ROW(H$2)+1),ROW(H69))),\"\")","v":""},{"$f":"IFERROR(INDEX(J$3:J$281,SMALL(IF(B$3:B$281=\"In\",ROW(J$2:J$280)-ROW(I$2)+1),ROW(I69))),\"\")","v":""},{"$f":"IFERROR(INDEX(K$3:K$281,SMALL(IF(B$3:B$281=\"In\",ROW(K$2:K$280)-ROW(J$2)+1),ROW(J69))),\"\")","v":""},{"$f":"IFERROR(INDEX(L$3:L$281,SMALL(IF(B$3:B$281=\"In\",ROW(L$2:L$280)-ROW(K$2)+1),ROW(K69))),\"\")","v":""}]
[false,"Out","DE","Mindset","Y",70,"Digital engagement",null,"Hours spent using Internet in last week","FinCap R9","Approximately how many hours in total have you spent actively using the Internet or doing things online in the last seven days? e.g. E-mail, web browsing/surfing and other on-line services such as downloading, streaming and online gaming. \nPlease don’t include time when you were connected but not using it. Please include both work and personal use. \n\n1. None – not used in the last week \n2. Less than 1 hour \n3. 1 – 3 hours \n4. 4 – 6 hours \n5. 7 – 10 hours \n6. 11 – 19 hours \n7. 20 – 29 hours \n8. 30 hours or more \n9. Don’t know",null,null,null,null,{"$f":"IFERROR(INDEX(F$3:F$281,SMALL(IF(B$3:B$281=\"In\",ROW(F$2:F$280)-ROW(F$2)+1),ROW(F70))),\"\")","v":""},{"$f":"IFERROR(INDEX(D$3:D$281,SMALL(IF(B$3:B$281=\"In\",ROW(D$2:D$280)-ROW(F$2)+1),ROW(F70))),\"\")","v":""},{"$f":"IFERROR(INDEX(E$3:E$281,SMALL(IF(B$3:B$281=\"In\",ROW(E$2:E$280)-ROW(E$2)+1),ROW(E70))),\"\")","v":""},{"$f":"IFERROR(INDEX(G$3:G$281,SMALL(IF(B$3:B$281=\"In\",ROW(F$2:F$280)-ROW(F$2)+1),ROW(F70))),\"\")","v":""},{"$f":"IFERROR(INDEX(H$3:H$281,SMALL(IF(B$3:B$281=\"In\",ROW(H$2:H$280)-ROW(G$2)+1),ROW(G70))),\"\")","v":""},{"$f":"IFERROR(INDEX(I$3:I$281,SMALL(IF(B$3:B$281=\"In\",ROW(I$2:I$280)-ROW(H$2)+1),ROW(H70))),\"\")","v":""},{"$f":"IFERROR(INDEX(J$3:J$281,SMALL(IF(B$3:B$281=\"In\",ROW(J$2:J$280)-ROW(I$2)+1),ROW(I70))),\"\")","v":""},{"$f":"IFERROR(INDEX(K$3:K$281,SMALL(IF(B$3:B$281=\"In\",ROW(K$2:K$280)-ROW(J$2)+1),ROW(J70))),\"\")","v":""},{"$f":"IFERROR(INDEX(L$3:L$281,SMALL(IF(B$3:B$281=\"In\",ROW(L$2:L$280)-ROW(K$2)+1),ROW(K70))),\"\")","v":""}]
[false,"Out","DE","Mindset","Y",71,"Digital engagement",null,"Level of confidence as an internet user","OfCom adults media use and attitudes 2017","How confident do you feel as an internet user\nPlease answer on a scale of 0 to 10, where 0 is ‘not at all confident and 10 is ‘very\nconfident\n\n1. 0 Not at all confident\n2. 1\n3. 2\n4. 3\n5. 4\n6. 5\n7. 6\n8. 7\n9. 8\n10. 9\n11. 10 Very confident\n12. Don’t know",null,null,null,null,{"$f":"IFERROR(INDEX(F$3:F$281,SMALL(IF(B$3:B$281=\"In\",ROW(F$2:F$280)-ROW(F$2)+1),ROW(F71))),\"\")","v":""},{"$f":"IFERROR(INDEX(D$3:D$281,SMALL(IF(B$3:B$281=\"In\",ROW(D$2:D$280)-ROW(F$2)+1),ROW(F71))),\"\")","v":""},{"$f":"IFERROR(INDEX(E$3:E$281,SMALL(IF(B$3:B$281=\"In\",ROW(E$2:E$280)-ROW(E$2)+1),ROW(E71))),\"\")","v":""},{"$f":"IFERROR(INDEX(G$3:G$281,SMALL(IF(B$3:B$281=\"In\",ROW(F$2:F$280)-ROW(F$2)+1),ROW(F71))),\"\")","v":""},{"$f":"IFERROR(INDEX(H$3:H$281,SMALL(IF(B$3:B$281=\"In\",ROW(H$2:H$280)-ROW(G$2)+1),ROW(G71))),\"\")","v":""},{"$f":"IFERROR(INDEX(I$3:I$281,SMALL(IF(B$3:B$281=\"In\",ROW(I$2:I$280)-ROW(H$2)+1),ROW(H71))),\"\")","v":""},{"$f":"IFERROR(INDEX(J$3:J$281,SMALL(IF(B$3:B$281=\"In\",ROW(J$2:J$280)-ROW(I$2)+1),ROW(I71))),\"\")","v":""},{"$f":"IFERROR(INDEX(K$3:K$281,SMALL(IF(B$3:B$281=\"In\",ROW(K$2:K$280)-ROW(J$2)+1),ROW(J71))),\"\")","v":""},{"$f":"IFERROR(INDEX(L$3:L$281,SMALL(IF(B$3:B$281=\"In\",ROW(L$2:L$280)-ROW(K$2)+1),ROW(K71))),\"\")","v":""}]
[null,null,null,null,null,72,"Digital engagement",null,null,"Fincap 2018 CRINTQ1","Which, if any, of these do you ever use the internet for - using any type of device including a laptop or desktop computer, a mobile phone or a tablet? MULTICODE OK FOR CODES 1-5 1. Online shopping (purchasing goods/ services / tickets etc.) or online trading/ auctions (e.g. eBay) 2. Online/mobile banking 3. Finding/ downloading information for work/ business/ school/ college/ university 4. Accessing news 5. Using social networking (such as Facebook, Twitter, Instagram, Snapchat, LinkedIn) 6. None of these",null,null,null,null,{"$f":"IFERROR(INDEX(F$3:F$281,SMALL(IF(B$3:B$281=\"In\",ROW(F$2:F$280)-ROW(F$2)+1),ROW(F72))),\"\")","v":""},{"$f":"IFERROR(INDEX(D$3:D$281,SMALL(IF(B$3:B$281=\"In\",ROW(D$2:D$280)-ROW(F$2)+1),ROW(F72))),\"\")","v":""},{"$f":"IFERROR(INDEX(E$3:E$281,SMALL(IF(B$3:B$281=\"In\",ROW(E$2:E$280)-ROW(E$2)+1),ROW(E72))),\"\")","v":""},{"$f":"IFERROR(INDEX(G$3:G$281,SMALL(IF(B$3:B$281=\"In\",ROW(F$2:F$280)-ROW(F$2)+1),ROW(F72))),\"\")","v":""},{"$f":"IFERROR(INDEX(H$3:H$281,SMALL(IF(B$3:B$281=\"In\",ROW(H$2:H$280)-ROW(G$2)+1),ROW(G72))),\"\")","v":""},{"$f":"IFERROR(INDEX(I$3:I$281,SMALL(IF(B$3:B$281=\"In\",ROW(I$2:I$280)-ROW(H$2)+1),ROW(H72))),\"\")","v":""},{"$f":"IFERROR(INDEX(J$3:J$281,SMALL(IF(B$3:B$281=\"In\",ROW(J$2:J$280)-ROW(I$2)+1),ROW(I72))),\"\")","v":""},{"$f":"IFERROR(INDEX(K$3:K$281,SMALL(IF(B$3:B$281=\"In\",ROW(K$2:K$280)-ROW(J$2)+1),ROW(J72))),\"\")","v":""},{"$f":"IFERROR(INDEX(L$3:L$281,SMALL(IF(B$3:B$281=\"In\",ROW(L$2:L$280)-ROW(K$2)+1),ROW(K72))),\"\")","v":""}]
[null,null,null,null,null,73,"Digital engagement",null,null,"Fincap 2018 R9","Approximately how many hours in total have you spent actively using the Internet or doing things online in the last seven days? e.g. E-mail, web browsing/surfing and other on-line services such as downloading, streaming and online gaming. Please don’t include time when you were connected but not using it. Please include both work and personal use. 1. None – not used in the last week 2. Less than 1 hour 3. 1 – 3 hours 4. 4 – 6 hours 45 5. 7 – 10 hours 6. 11 – 19 hours 7. 20 – 29 hours 8. 30 hours or more 9. Don’t know",null,null,null,null,{"$f":"IFERROR(INDEX(F$3:F$281,SMALL(IF(B$3:B$281=\"In\",ROW(F$2:F$280)-ROW(F$2)+1),ROW(F73))),\"\")","v":""},{"$f":"IFERROR(INDEX(D$3:D$281,SMALL(IF(B$3:B$281=\"In\",ROW(D$2:D$280)-ROW(F$2)+1),ROW(F73))),\"\")","v":""},{"$f":"IFERROR(INDEX(E$3:E$281,SMALL(IF(B$3:B$281=\"In\",ROW(E$2:E$280)-ROW(E$2)+1),ROW(E73))),\"\")","v":""},{"$f":"IFERROR(INDEX(G$3:G$281,SMALL(IF(B$3:B$281=\"In\",ROW(F$2:F$280)-ROW(F$2)+1),ROW(F73))),\"\")","v":""},{"$f":"IFERROR(INDEX(H$3:H$281,SMALL(IF(B$3:B$281=\"In\",ROW(H$2:H$280)-ROW(G$2)+1),ROW(G73))),\"\")","v":""},{"$f":"IFERROR(INDEX(I$3:I$281,SMALL(IF(B$3:B$281=\"In\",ROW(I$2:I$280)-ROW(H$2)+1),ROW(H73))),\"\")","v":""},{"$f":"IFERROR(INDEX(J$3:J$281,SMALL(IF(B$3:B$281=\"In\",ROW(J$2:J$280)-ROW(I$2)+1),ROW(I73))),\"\")","v":""},{"$f":"IFERROR(INDEX(K$3:K$281,SMALL(IF(B$3:B$281=\"In\",ROW(K$2:K$280)-ROW(J$2)+1),ROW(J73))),\"\")","v":""},{"$f":"IFERROR(INDEX(L$3:L$281,SMALL(IF(B$3:B$281=\"In\",ROW(L$2:L$280)-ROW(K$2)+1),ROW(K73))),\"\")","v":""}]
[null,null,null,null,null,74,"Digital engagement",null,null,"Fincap 2018 B7","How confident do you feel as an internet user\nPlease answer on a scale of 0 to 10, where 0 is ‘not at all confident and 10 is ‘very\nconfident\n1. 0 Not at all confident\n2. 1\n3. 2\n4. 3\n5. 4\n6. 5\n7. 6\n8. 7\n9. 8\n10. 9\n11. 10 Very confident\n12. Don’t know",null,null,null,null,{"$f":"IFERROR(INDEX(F$3:F$281,SMALL(IF(B$3:B$281=\"In\",ROW(F$2:F$280)-ROW(F$2)+1),ROW(F74))),\"\")","v":""},{"$f":"IFERROR(INDEX(D$3:D$281,SMALL(IF(B$3:B$281=\"In\",ROW(D$2:D$280)-ROW(F$2)+1),ROW(F74))),\"\")","v":""},{"$f":"IFERROR(INDEX(E$3:E$281,SMALL(IF(B$3:B$281=\"In\",ROW(E$2:E$280)-ROW(E$2)+1),ROW(E74))),\"\")","v":""},{"$f":"IFERROR(INDEX(G$3:G$281,SMALL(IF(B$3:B$281=\"In\",ROW(F$2:F$280)-ROW(F$2)+1),ROW(F74))),\"\")","v":""},{"$f":"IFERROR(INDEX(H$3:H$281,SMALL(IF(B$3:B$281=\"In\",ROW(H$2:H$280)-ROW(G$2)+1),ROW(G74))),\"\")","v":""},{"$f":"IFERROR(INDEX(I$3:I$281,SMALL(IF(B$3:B$281=\"In\",ROW(I$2:I$280)-ROW(H$2)+1),ROW(H74))),\"\")","v":""},{"$f":"IFERROR(INDEX(J$3:J$281,SMALL(IF(B$3:B$281=\"In\",ROW(J$2:J$280)-ROW(I$2)+1),ROW(I74))),\"\")","v":""},{"$f":"IFERROR(INDEX(K$3:K$281,SMALL(IF(B$3:B$281=\"In\",ROW(K$2:K$280)-ROW(J$2)+1),ROW(J74))),\"\")","v":""},{"$f":"IFERROR(INDEX(L$3:L$281,SMALL(IF(B$3:B$281=\"In\",ROW(L$2:L$280)-ROW(K$2)+1),ROW(K74))),\"\")","v":""}]
[false,{"$f":"IF(A77=TRUE,\"In\",\"Out\")","v":"Out"},"EWAG","Mindset","N",75,"Engagement with advice/guidance","Belief that money advice and guidance can help them","Likelihood of seeking money advice and guidance","NEW","How likely are you to take advice about dealing with money issues from a free advice organisation to deal with money worries? This could include Citizen's Advice Bureau, Money Advice Service or StepChange.\n\nCHOOSE ONE ONLY\n\n1. Very likely\n2. Fairly likely\n3. Fairly unlikely\n4. Very unlikely\n5. Don’t know\n",null,null,null,null,{"$f":"IFERROR(INDEX(F$3:F$281,SMALL(IF(B$3:B$281=\"In\",ROW(F$2:F$280)-ROW(F$2)+1),ROW(F75))),\"\")","v":""},{"$f":"IFERROR(INDEX(D$3:D$281,SMALL(IF(B$3:B$281=\"In\",ROW(D$2:D$280)-ROW(F$2)+1),ROW(F75))),\"\")","v":""},{"$f":"IFERROR(INDEX(E$3:E$281,SMALL(IF(B$3:B$281=\"In\",ROW(E$2:E$280)-ROW(E$2)+1),ROW(E75))),\"\")","v":""},{"$f":"IFERROR(INDEX(G$3:G$281,SMALL(IF(B$3:B$281=\"In\",ROW(F$2:F$280)-ROW(F$2)+1),ROW(F75))),\"\")","v":""},{"$f":"IFERROR(INDEX(H$3:H$281,SMALL(IF(B$3:B$281=\"In\",ROW(H$2:H$280)-ROW(G$2)+1),ROW(G75))),\"\")","v":""},{"$f":"IFERROR(INDEX(I$3:I$281,SMALL(IF(B$3:B$281=\"In\",ROW(I$2:I$280)-ROW(H$2)+1),ROW(H75))),\"\")","v":""},{"$f":"IFERROR(INDEX(J$3:J$281,SMALL(IF(B$3:B$281=\"In\",ROW(J$2:J$280)-ROW(I$2)+1),ROW(I75))),\"\")","v":""},{"$f":"IFERROR(INDEX(K$3:K$281,SMALL(IF(B$3:B$281=\"In\",ROW(K$2:K$280)-ROW(J$2)+1),ROW(J75))),\"\")","v":""},{"$f":"IFERROR(INDEX(L$3:L$281,SMALL(IF(B$3:B$281=\"In\",ROW(L$2:L$280)-ROW(K$2)+1),ROW(K75))),\"\")","v":""}]
[false,"Out","EWAG","Mindset","N",76,"Engagement with advice/guidance","Belief that money advice and guidance can help them","Attitude towards money advice and guidance ","NEW","How much do you agree or disagree with each of the following statements? When we say advice and guidance, we mean from organisations like Citizen's Advice Bureau, Money Advice Service or StepChange and also from accountants and independent financial advisers\n\n• Asking for financial advice and guidance seems too scary \n• I’d feel embarrassed to take financial advice and guidance\n• I’d make better financial decisions with financial advice and guidance\n• I can sort out my own money issues, without financial advice and guidance\n• When it comes to things like bank accounts, credit cards or insurance, there’s not enough information out there I can trust\n",null,null,null,null,{"$f":"IFERROR(INDEX(F$3:F$281,SMALL(IF(B$3:B$281=\"In\",ROW(F$2:F$280)-ROW(F$2)+1),ROW(F76))),\"\")","v":""},{"$f":"IFERROR(INDEX(D$3:D$281,SMALL(IF(B$3:B$281=\"In\",ROW(D$2:D$280)-ROW(F$2)+1),ROW(F76))),\"\")","v":""},{"$f":"IFERROR(INDEX(E$3:E$281,SMALL(IF(B$3:B$281=\"In\",ROW(E$2:E$280)-ROW(E$2)+1),ROW(E76))),\"\")","v":""},{"$f":"IFERROR(INDEX(G$3:G$281,SMALL(IF(B$3:B$281=\"In\",ROW(F$2:F$280)-ROW(F$2)+1),ROW(F76))),\"\")","v":""},{"$f":"IFERROR(INDEX(H$3:H$281,SMALL(IF(B$3:B$281=\"In\",ROW(H$2:H$280)-ROW(G$2)+1),ROW(G76))),\"\")","v":""},{"$f":"IFERROR(INDEX(I$3:I$281,SMALL(IF(B$3:B$281=\"In\",ROW(I$2:I$280)-ROW(H$2)+1),ROW(H76))),\"\")","v":""},{"$f":"IFERROR(INDEX(J$3:J$281,SMALL(IF(B$3:B$281=\"In\",ROW(J$2:J$280)-ROW(I$2)+1),ROW(I76))),\"\")","v":""},{"$f":"IFERROR(INDEX(K$3:K$281,SMALL(IF(B$3:B$281=\"In\",ROW(K$2:K$280)-ROW(J$2)+1),ROW(J76))),\"\")","v":""},{"$f":"IFERROR(INDEX(L$3:L$281,SMALL(IF(B$3:B$281=\"In\",ROW(L$2:L$280)-ROW(K$2)+1),ROW(K76))),\"\")","v":""}]
[false,"Out","EWAG","Mindset","Y",77,"Engagement with advice/guidance",null,"Whether would consult external advice organisation","Fincap 2018 C3","Is consulting an advice organisation about debt something.....?\nPLEASE SELECT ONE ONLY\n\n1. You are currently doing\n2. You are planning to do soon\n3. You are thinking about doing in the future\n4. You don’t have any plans to do so but you might consider it\n5. You would consider if your situation got worse\n6. You cannot see yourself doing\n7. You would never consider\n8. Don’t know",null,null,null,null,{"$f":"IFERROR(INDEX(F$3:F$281,SMALL(IF(B$3:B$281=\"In\",ROW(F$2:F$280)-ROW(F$2)+1),ROW(F77))),\"\")","v":""},{"$f":"IFERROR(INDEX(D$3:D$281,SMALL(IF(B$3:B$281=\"In\",ROW(D$2:D$280)-ROW(F$2)+1),ROW(F77))),\"\")","v":""},{"$f":"IFERROR(INDEX(E$3:E$281,SMALL(IF(B$3:B$281=\"In\",ROW(E$2:E$280)-ROW(E$2)+1),ROW(E77))),\"\")","v":""},{"$f":"IFERROR(INDEX(G$3:G$281,SMALL(IF(B$3:B$281=\"In\",ROW(F$2:F$280)-ROW(F$2)+1),ROW(F77))),\"\")","v":""},{"$f":"IFERROR(INDEX(H$3:H$281,SMALL(IF(B$3:B$281=\"In\",ROW(H$2:H$280)-ROW(G$2)+1),ROW(G77))),\"\")","v":""},{"$f":"IFERROR(INDEX(I$3:I$281,SMALL(IF(B$3:B$281=\"In\",ROW(I$2:I$280)-ROW(H$2)+1),ROW(H77))),\"\")","v":""},{"$f":"IFERROR(INDEX(J$3:J$281,SMALL(IF(B$3:B$281=\"In\",ROW(J$2:J$280)-ROW(I$2)+1),ROW(I77))),\"\")","v":""},{"$f":"IFERROR(INDEX(K$3:K$281,SMALL(IF(B$3:B$281=\"In\",ROW(K$2:K$280)-ROW(J$2)+1),ROW(J77))),\"\")","v":""},{"$f":"IFERROR(INDEX(L$3:L$281,SMALL(IF(B$3:B$281=\"In\",ROW(L$2:L$280)-ROW(K$2)+1),ROW(K77))),\"\")","v":""}]
[false,"Out","EWAG","Mindset","Y",78,"Engagement with advice/guidance",null,"Sources of guidance used in last year (m301-m309)","FinCap M3","PRE. Which of the following sources of information have you used in the last year to find out about anything to do with money – whether that is how to budget or plan your finances, the best insurance, banking or credit products available, how to claim benefits or grants, or to get any help or advice, etc. \nPLEASE SELECT ALL THAT APPLY. \n\n1. Family / Friends \n2. Financial Pages in Newspapers/Magazines \n3. Bank / Insurance Company \n4. Broker/ Professional Advisor \n5. Internet – Price Comparison Websites e.g. GoCompare, Moneysupermarket, Comparethemarket, Confused etc. \n6. Internet – General Sites or Searches e.g. Google, Yahoo, BBC etc. \n7. Internet – Specialist Site e.g. moneysavingexpert.com, \n8. Government/ Non-Government Funded Org’s (e.g. Citizens Advice / CAB) \n9. Other \n10. None of these \n11. Don’t know\n\nPOST. Which of the following sources of information have you used since [REFERENCE POINT] to find out about anything to do with money – whether that is how to budget or plan your finances, the best insurance, banking or credit products available, how to claim benefits or grants, or to get any help or advice, etc. \nPLEASE SELECT ALL THAT APPLY. \n\n1. Family / Friends \n2. Financial Pages in Newspapers/Magazines \n3. Bank / Insurance Company \n4. Broker/ Professional Advisor \n5. Internet – Price Comparison Websites e.g. GoCompare, Moneysupermarket, Comparethemarket, Confused etc. \n6. Internet – General Sites or Searches e.g. Google, Yahoo, BBC etc. \n7. Internet – Specialist Site e.g. moneysavingexpert.com, \n8. Government/ Non-Government Funded Org’s (e.g. Citizens Advice / CAB) \n9. Other \n10. None of these \n11. Don’t know",null,null,null,null,{"$f":"IFERROR(INDEX(F$3:F$281,SMALL(IF(B$3:B$281=\"In\",ROW(F$2:F$280)-ROW(F$2)+1),ROW(F78))),\"\")","v":""},{"$f":"IFERROR(INDEX(D$3:D$281,SMALL(IF(B$3:B$281=\"In\",ROW(D$2:D$280)-ROW(F$2)+1),ROW(F78))),\"\")","v":""},{"$f":"IFERROR(INDEX(E$3:E$281,SMALL(IF(B$3:B$281=\"In\",ROW(E$2:E$280)-ROW(E$2)+1),ROW(E78))),\"\")","v":""},{"$f":"IFERROR(INDEX(G$3:G$281,SMALL(IF(B$3:B$281=\"In\",ROW(F$2:F$280)-ROW(F$2)+1),ROW(F78))),\"\")","v":""},{"$f":"IFERROR(INDEX(H$3:H$281,SMALL(IF(B$3:B$281=\"In\",ROW(H$2:H$280)-ROW(G$2)+1),ROW(G78))),\"\")","v":""},{"$f":"IFERROR(INDEX(I$3:I$281,SMALL(IF(B$3:B$281=\"In\",ROW(I$2:I$280)-ROW(H$2)+1),ROW(H78))),\"\")","v":""},{"$f":"IFERROR(INDEX(J$3:J$281,SMALL(IF(B$3:B$281=\"In\",ROW(J$2:J$280)-ROW(I$2)+1),ROW(I78))),\"\")","v":""},{"$f":"IFERROR(INDEX(K$3:K$281,SMALL(IF(B$3:B$281=\"In\",ROW(K$2:K$280)-ROW(J$2)+1),ROW(J78))),\"\")","v":""},{"$f":"IFERROR(INDEX(L$3:L$281,SMALL(IF(B$3:B$281=\"In\",ROW(L$2:L$280)-ROW(K$2)+1),ROW(K78))),\"\")","v":""}]
[false,"Out","EWAG","Mindset","Y",79,"Engagement with advice/guidance",null,"Awareness of organisations and websites that offer free advice/guidance","FinCap 2018 iga1t","How aware are you of organisations and websites that can offer free or affordable financial information, help and support to people when they are making financial decisions? \n\n1. I know of a few organisations / sources that offer such services and know how to find them 76 \n2. I know such organisations / sources exist and am sure I could find them if I need to \n3. I assume such organisations / sources exist and that I could find them if I need to \n4. I am not sure if such organisations / sources exist or whether I could find them \n5. I don’t think these organisations / sources exist and wouldn’t know how to find them if they did \n6. Don’t know",null,null,null,null,{"$f":"IFERROR(INDEX(F$3:F$281,SMALL(IF(B$3:B$281=\"In\",ROW(F$2:F$280)-ROW(F$2)+1),ROW(F79))),\"\")","v":""},{"$f":"IFERROR(INDEX(D$3:D$281,SMALL(IF(B$3:B$281=\"In\",ROW(D$2:D$280)-ROW(F$2)+1),ROW(F79))),\"\")","v":""},{"$f":"IFERROR(INDEX(E$3:E$281,SMALL(IF(B$3:B$281=\"In\",ROW(E$2:E$280)-ROW(E$2)+1),ROW(E79))),\"\")","v":""},{"$f":"IFERROR(INDEX(G$3:G$281,SMALL(IF(B$3:B$281=\"In\",ROW(F$2:F$280)-ROW(F$2)+1),ROW(F79))),\"\")","v":""},{"$f":"IFERROR(INDEX(H$3:H$281,SMALL(IF(B$3:B$281=\"In\",ROW(H$2:H$280)-ROW(G$2)+1),ROW(G79))),\"\")","v":""},{"$f":"IFERROR(INDEX(I$3:I$281,SMALL(IF(B$3:B$281=\"In\",ROW(I$2:I$280)-ROW(H$2)+1),ROW(H79))),\"\")","v":""},{"$f":"IFERROR(INDEX(J$3:J$281,SMALL(IF(B$3:B$281=\"In\",ROW(J$2:J$280)-ROW(I$2)+1),ROW(I79))),\"\")","v":""},{"$f":"IFERROR(INDEX(K$3:K$281,SMALL(IF(B$3:B$281=\"In\",ROW(K$2:K$280)-ROW(J$2)+1),ROW(J79))),\"\")","v":""},{"$f":"IFERROR(INDEX(L$3:L$281,SMALL(IF(B$3:B$281=\"In\",ROW(L$2:L$280)-ROW(K$2)+1),ROW(K79))),\"\")","v":""}]
[false,"Out","EWAG","Mindset","N",80,"Confidence communicating with financial professionals "," ","Confidence talking to professionals about money","NEW","How confident would you feel talking to people who can give you advice about money\n\n1.Very confident \n2. Fairly confident \n3. Not very confident \n4. Not at all confident\n5. Don't know\n",null,null,null,null,{"$f":"IFERROR(INDEX(F$3:F$281,SMALL(IF(B$3:B$281=\"In\",ROW(F$2:F$280)-ROW(F$2)+1),ROW(F80))),\"\")","v":""},{"$f":"IFERROR(INDEX(D$3:D$281,SMALL(IF(B$3:B$281=\"In\",ROW(D$2:D$280)-ROW(F$2)+1),ROW(F80))),\"\")","v":""},{"$f":"IFERROR(INDEX(E$3:E$281,SMALL(IF(B$3:B$281=\"In\",ROW(E$2:E$280)-ROW(E$2)+1),ROW(E80))),\"\")","v":""},{"$f":"IFERROR(INDEX(G$3:G$281,SMALL(IF(B$3:B$281=\"In\",ROW(F$2:F$280)-ROW(F$2)+1),ROW(F80))),\"\")","v":""},{"$f":"IFERROR(INDEX(H$3:H$281,SMALL(IF(B$3:B$281=\"In\",ROW(H$2:H$280)-ROW(G$2)+1),ROW(G80))),\"\")","v":""},{"$f":"IFERROR(INDEX(I$3:I$281,SMALL(IF(B$3:B$281=\"In\",ROW(I$2:I$280)-ROW(H$2)+1),ROW(H80))),\"\")","v":""},{"$f":"IFERROR(INDEX(J$3:J$281,SMALL(IF(B$3:B$281=\"In\",ROW(J$2:J$280)-ROW(I$2)+1),ROW(I80))),\"\")","v":""},{"$f":"IFERROR(INDEX(K$3:K$281,SMALL(IF(B$3:B$281=\"In\",ROW(K$2:K$280)-ROW(J$2)+1),ROW(J80))),\"\")","v":""},{"$f":"IFERROR(INDEX(L$3:L$281,SMALL(IF(B$3:B$281=\"In\",ROW(L$2:L$280)-ROW(K$2)+1),ROW(K80))),\"\")","v":""}]
[false,"Out","SO","Mindset","Y",81,"Saving orientation","Recognise the importance of saving for an unexpected event ","Perceived importance of saving for a rainy day","Fincap (O3A)","Thinking overall about your finances, how important do you think it is to save for a rainy day \n\n1. Very important\n2. Fairly important\n3. Neither important nor unimportant\n4. Fairly unimportant\n5. Very unimportant\n6. Don’t know",null,null,null,null,{"$f":"IFERROR(INDEX(F$3:F$281,SMALL(IF(B$3:B$281=\"In\",ROW(F$2:F$280)-ROW(F$2)+1),ROW(F81))),\"\")","v":""},{"$f":"IFERROR(INDEX(D$3:D$281,SMALL(IF(B$3:B$281=\"In\",ROW(D$2:D$280)-ROW(F$2)+1),ROW(F81))),\"\")","v":""},{"$f":"IFERROR(INDEX(E$3:E$281,SMALL(IF(B$3:B$281=\"In\",ROW(E$2:E$280)-ROW(E$2)+1),ROW(E81))),\"\")","v":""},{"$f":"IFERROR(INDEX(G$3:G$281,SMALL(IF(B$3:B$281=\"In\",ROW(F$2:F$280)-ROW(F$2)+1),ROW(F81))),\"\")","v":""},{"$f":"IFERROR(INDEX(H$3:H$281,SMALL(IF(B$3:B$281=\"In\",ROW(H$2:H$280)-ROW(G$2)+1),ROW(G81))),\"\")","v":""},{"$f":"IFERROR(INDEX(I$3:I$281,SMALL(IF(B$3:B$281=\"In\",ROW(I$2:I$280)-ROW(H$2)+1),ROW(H81))),\"\")","v":""},{"$f":"IFERROR(INDEX(J$3:J$281,SMALL(IF(B$3:B$281=\"In\",ROW(J$2:J$280)-ROW(I$2)+1),ROW(I81))),\"\")","v":""},{"$f":"IFERROR(INDEX(K$3:K$281,SMALL(IF(B$3:B$281=\"In\",ROW(K$2:K$280)-ROW(J$2)+1),ROW(J81))),\"\")","v":""},{"$f":"IFERROR(INDEX(L$3:L$281,SMALL(IF(B$3:B$281=\"In\",ROW(L$2:L$280)-ROW(K$2)+1),ROW(K81))),\"\")","v":""}]
[false,"Out","SO","Mindset","Y",82,"Saving orientation","Recognise the importance of future financial needs in retirement","Perceived importance of putting money aside for retirement","Fincap (O3B) ","How important do you think it is to put money aside for your retirement\n\n1. Very important\n2. Fairly important\n3. Neither important nor unimportant\n4. Fairly unimportant\n5. Very unimportant\n6. Don’t know",null,null,null,null,{"$f":"IFERROR(INDEX(F$3:F$281,SMALL(IF(B$3:B$281=\"In\",ROW(F$2:F$280)-ROW(F$2)+1),ROW(F82))),\"\")","v":""},{"$f":"IFERROR(INDEX(D$3:D$281,SMALL(IF(B$3:B$281=\"In\",ROW(D$2:D$280)-ROW(F$2)+1),ROW(F82))),\"\")","v":""},{"$f":"IFERROR(INDEX(E$3:E$281,SMALL(IF(B$3:B$281=\"In\",ROW(E$2:E$280)-ROW(E$2)+1),ROW(E82))),\"\")","v":""},{"$f":"IFERROR(INDEX(G$3:G$281,SMALL(IF(B$3:B$281=\"In\",ROW(F$2:F$280)-ROW(F$2)+1),ROW(F82))),\"\")","v":""},{"$f":"IFERROR(INDEX(H$3:H$281,SMALL(IF(B$3:B$281=\"In\",ROW(H$2:H$280)-ROW(G$2)+1),ROW(G82))),\"\")","v":""},{"$f":"IFERROR(INDEX(I$3:I$281,SMALL(IF(B$3:B$281=\"In\",ROW(I$2:I$280)-ROW(H$2)+1),ROW(H82))),\"\")","v":""},{"$f":"IFERROR(INDEX(J$3:J$281,SMALL(IF(B$3:B$281=\"In\",ROW(J$2:J$280)-ROW(I$2)+1),ROW(I82))),\"\")","v":""},{"$f":"IFERROR(INDEX(K$3:K$281,SMALL(IF(B$3:B$281=\"In\",ROW(K$2:K$280)-ROW(J$2)+1),ROW(J82))),\"\")","v":""},{"$f":"IFERROR(INDEX(L$3:L$281,SMALL(IF(B$3:B$281=\"In\",ROW(L$2:L$280)-ROW(K$2)+1),ROW(K82))),\"\")","v":""}]
[false,"Out","SO","Mindset","Y",83,"Saving orientation","Motivated to keep track of finances ","Perceived importance of keeping track of income and expenditure ","Fincap (O3C)","How important do you think it is to keep track of your household’s income and expenditure \n\n1. Very important\n2. Fairly important\n3. Neither important nor unimportant\n4. Fairly unimportant\n5. Very unimportant\n6. Don’t know\n",null,null,null,null,{"$f":"IFERROR(INDEX(F$3:F$281,SMALL(IF(B$3:B$281=\"In\",ROW(F$2:F$280)-ROW(F$2)+1),ROW(F83))),\"\")","v":""},{"$f":"IFERROR(INDEX(D$3:D$281,SMALL(IF(B$3:B$281=\"In\",ROW(D$2:D$280)-ROW(F$2)+1),ROW(F83))),\"\")","v":""},{"$f":"IFERROR(INDEX(E$3:E$281,SMALL(IF(B$3:B$281=\"In\",ROW(E$2:E$280)-ROW(E$2)+1),ROW(E83))),\"\")","v":""},{"$f":"IFERROR(INDEX(G$3:G$281,SMALL(IF(B$3:B$281=\"In\",ROW(F$2:F$280)-ROW(F$2)+1),ROW(F83))),\"\")","v":""},{"$f":"IFERROR(INDEX(H$3:H$281,SMALL(IF(B$3:B$281=\"In\",ROW(H$2:H$280)-ROW(G$2)+1),ROW(G83))),\"\")","v":""},{"$f":"IFERROR(INDEX(I$3:I$281,SMALL(IF(B$3:B$281=\"In\",ROW(I$2:I$280)-ROW(H$2)+1),ROW(H83))),\"\")","v":""},{"$f":"IFERROR(INDEX(J$3:J$281,SMALL(IF(B$3:B$281=\"In\",ROW(J$2:J$280)-ROW(I$2)+1),ROW(I83))),\"\")","v":""},{"$f":"IFERROR(INDEX(K$3:K$281,SMALL(IF(B$3:B$281=\"In\",ROW(K$2:K$280)-ROW(J$2)+1),ROW(J83))),\"\")","v":""},{"$f":"IFERROR(INDEX(L$3:L$281,SMALL(IF(B$3:B$281=\"In\",ROW(L$2:L$280)-ROW(K$2)+1),ROW(K83))),\"\")","v":""}]
[false,"Out","SO","Mindset","Y",84,"Saving orientation","Understand the value of making their money go further by shopping around","Perceived importance of shopping around","Fincap (O3D) ","How important do you think it is to shop around in order to make your money go further \n\n1. Very important\n2. Fairly important\n3. Neither important nor unimportant\n4. Fairly unimportant\n5. Very unimportant\n6. Don’t know",null,null,null,null,{"$f":"IFERROR(INDEX(F$3:F$281,SMALL(IF(B$3:B$281=\"In\",ROW(F$2:F$280)-ROW(F$2)+1),ROW(F84))),\"\")","v":""},{"$f":"IFERROR(INDEX(D$3:D$281,SMALL(IF(B$3:B$281=\"In\",ROW(D$2:D$280)-ROW(F$2)+1),ROW(F84))),\"\")","v":""},{"$f":"IFERROR(INDEX(E$3:E$281,SMALL(IF(B$3:B$281=\"In\",ROW(E$2:E$280)-ROW(E$2)+1),ROW(E84))),\"\")","v":""},{"$f":"IFERROR(INDEX(G$3:G$281,SMALL(IF(B$3:B$281=\"In\",ROW(F$2:F$280)-ROW(F$2)+1),ROW(F84))),\"\")","v":""},{"$f":"IFERROR(INDEX(H$3:H$281,SMALL(IF(B$3:B$281=\"In\",ROW(H$2:H$280)-ROW(G$2)+1),ROW(G84))),\"\")","v":""},{"$f":"IFERROR(INDEX(I$3:I$281,SMALL(IF(B$3:B$281=\"In\",ROW(I$2:I$280)-ROW(H$2)+1),ROW(H84))),\"\")","v":""},{"$f":"IFERROR(INDEX(J$3:J$281,SMALL(IF(B$3:B$281=\"In\",ROW(J$2:J$280)-ROW(I$2)+1),ROW(I84))),\"\")","v":""},{"$f":"IFERROR(INDEX(K$3:K$281,SMALL(IF(B$3:B$281=\"In\",ROW(K$2:K$280)-ROW(J$2)+1),ROW(J84))),\"\")","v":""},{"$f":"IFERROR(INDEX(L$3:L$281,SMALL(IF(B$3:B$281=\"In\",ROW(L$2:L$280)-ROW(K$2)+1),ROW(K84))),\"\")","v":""}]
[false,"Out","SO","Mindset","N",85,"Saving orientation","Understand the value of making their money go further by shopping around","Attitude to switching suppliers ","NEW","How much do you agree or disagree with each of the following statements?:\n- I prefer to stick with one company over time rather than keep changing suppliers*\n- There's no point switching things like insurance, energy or bank accounts, it's not worth the hassle\n\n1. Strongly agree\n2. Tend to agree\n3. Neither agree nor disagree\n4. Tend to disagree\n5. Strongly disagree\n6. Don’t know\n",null,null,null,null,{"$f":"IFERROR(INDEX(F$3:F$281,SMALL(IF(B$3:B$281=\"In\",ROW(F$2:F$280)-ROW(F$2)+1),ROW(F85))),\"\")","v":""},{"$f":"IFERROR(INDEX(D$3:D$281,SMALL(IF(B$3:B$281=\"In\",ROW(D$2:D$280)-ROW(F$2)+1),ROW(F85))),\"\")","v":""},{"$f":"IFERROR(INDEX(E$3:E$281,SMALL(IF(B$3:B$281=\"In\",ROW(E$2:E$280)-ROW(E$2)+1),ROW(E85))),\"\")","v":""},{"$f":"IFERROR(INDEX(G$3:G$281,SMALL(IF(B$3:B$281=\"In\",ROW(F$2:F$280)-ROW(F$2)+1),ROW(F85))),\"\")","v":""},{"$f":"IFERROR(INDEX(H$3:H$281,SMALL(IF(B$3:B$281=\"In\",ROW(H$2:H$280)-ROW(G$2)+1),ROW(G85))),\"\")","v":""},{"$f":"IFERROR(INDEX(I$3:I$281,SMALL(IF(B$3:B$281=\"In\",ROW(I$2:I$280)-ROW(H$2)+1),ROW(H85))),\"\")","v":""},{"$f":"IFERROR(INDEX(J$3:J$281,SMALL(IF(B$3:B$281=\"In\",ROW(J$2:J$280)-ROW(I$2)+1),ROW(I85))),\"\")","v":""},{"$f":"IFERROR(INDEX(K$3:K$281,SMALL(IF(B$3:B$281=\"In\",ROW(K$2:K$280)-ROW(J$2)+1),ROW(J85))),\"\")","v":""},{"$f":"IFERROR(INDEX(L$3:L$281,SMALL(IF(B$3:B$281=\"In\",ROW(L$2:L$280)-ROW(K$2)+1),ROW(K85))),\"\")","v":""}]
[false,"Out","FC","Mindset","Y",86,"Financial confidence","Confident managing money","Level of confidence in managing money","Fincap (B3","How confident do you feel about managing your money?  \n\nPlease answer on a scale of 0 to 10, where 0 is ‘not at all confident and 10 is ‘very confident\n 0…10 scale\nDon't know\n",null,null,null,null,{"$f":"IFERROR(INDEX(F$3:F$281,SMALL(IF(B$3:B$281=\"In\",ROW(F$2:F$280)-ROW(F$2)+1),ROW(F86))),\"\")","v":""},{"$f":"IFERROR(INDEX(D$3:D$281,SMALL(IF(B$3:B$281=\"In\",ROW(D$2:D$280)-ROW(F$2)+1),ROW(F86))),\"\")","v":""},{"$f":"IFERROR(INDEX(E$3:E$281,SMALL(IF(B$3:B$281=\"In\",ROW(E$2:E$280)-ROW(E$2)+1),ROW(E86))),\"\")","v":""},{"$f":"IFERROR(INDEX(G$3:G$281,SMALL(IF(B$3:B$281=\"In\",ROW(F$2:F$280)-ROW(F$2)+1),ROW(F86))),\"\")","v":""},{"$f":"IFERROR(INDEX(H$3:H$281,SMALL(IF(B$3:B$281=\"In\",ROW(H$2:H$280)-ROW(G$2)+1),ROW(G86))),\"\")","v":""},{"$f":"IFERROR(INDEX(I$3:I$281,SMALL(IF(B$3:B$281=\"In\",ROW(I$2:I$280)-ROW(H$2)+1),ROW(H86))),\"\")","v":""},{"$f":"IFERROR(INDEX(J$3:J$281,SMALL(IF(B$3:B$281=\"In\",ROW(J$2:J$280)-ROW(I$2)+1),ROW(I86))),\"\")","v":""},{"$f":"IFERROR(INDEX(K$3:K$281,SMALL(IF(B$3:B$281=\"In\",ROW(K$2:K$280)-ROW(J$2)+1),ROW(J86))),\"\")","v":""},{"$f":"IFERROR(INDEX(L$3:L$281,SMALL(IF(B$3:B$281=\"In\",ROW(L$2:L$280)-ROW(K$2)+1),ROW(K86))),\"\")","v":""}]
[false,"Out","FC","Mindset","Y",87,"Financial confidence","Confident making decisions about products/services","Level of confidence making decisions about products/services",")","How confident do you feel making decisions about financial products and services?  \n\nPlease answer on a scale of 0 to 10, where 0 is ‘not at all confident and 10 is ‘very confident\n 0…10 scale\nDon't know\n",null,null,null,null,{"$f":"IFERROR(INDEX(F$3:F$281,SMALL(IF(B$3:B$281=\"In\",ROW(F$2:F$280)-ROW(F$2)+1),ROW(F87))),\"\")","v":""},{"$f":"IFERROR(INDEX(D$3:D$281,SMALL(IF(B$3:B$281=\"In\",ROW(D$2:D$280)-ROW(F$2)+1),ROW(F87))),\"\")","v":""},{"$f":"IFERROR(INDEX(E$3:E$281,SMALL(IF(B$3:B$281=\"In\",ROW(E$2:E$280)-ROW(E$2)+1),ROW(E87))),\"\")","v":""},{"$f":"IFERROR(INDEX(G$3:G$281,SMALL(IF(B$3:B$281=\"In\",ROW(F$2:F$280)-ROW(F$2)+1),ROW(F87))),\"\")","v":""},{"$f":"IFERROR(INDEX(H$3:H$281,SMALL(IF(B$3:B$281=\"In\",ROW(H$2:H$280)-ROW(G$2)+1),ROW(G87))),\"\")","v":""},{"$f":"IFERROR(INDEX(I$3:I$281,SMALL(IF(B$3:B$281=\"In\",ROW(I$2:I$280)-ROW(H$2)+1),ROW(H87))),\"\")","v":""},{"$f":"IFERROR(INDEX(J$3:J$281,SMALL(IF(B$3:B$281=\"In\",ROW(J$2:J$280)-ROW(I$2)+1),ROW(I87))),\"\")","v":""},{"$f":"IFERROR(INDEX(K$3:K$281,SMALL(IF(B$3:B$281=\"In\",ROW(K$2:K$280)-ROW(J$2)+1),ROW(J87))),\"\")","v":""},{"$f":"IFERROR(INDEX(L$3:L$281,SMALL(IF(B$3:B$281=\"In\",ROW(L$2:L$280)-ROW(K$2)+1),ROW(K87))),\"\")","v":""}]
[false,"Out","FC","Mindset","Y",88,"Financial confidence","How confident working with numbers in everyday life",null,"Fincap 2018 B5","How confident do you feel working with numbers when you need to in everyday life?\nPlease answer on a scale of 0 to 10, where 0 is ‘not at all confident and 10 is ‘very\nconfident\n\n1. 0 Not at all confident\n2. 1\n3. 2\n4. 3\n5. 4\n6. 5\n7. 6\n8. 7\n9. 8\n10. 9\n11. 10 Very confident\n12. Don’t know",null,null,null,null,{"$f":"IFERROR(INDEX(F$3:F$281,SMALL(IF(B$3:B$281=\"In\",ROW(F$2:F$280)-ROW(F$2)+1),ROW(F88))),\"\")","v":""},{"$f":"IFERROR(INDEX(D$3:D$281,SMALL(IF(B$3:B$281=\"In\",ROW(D$2:D$280)-ROW(F$2)+1),ROW(F88))),\"\")","v":""},{"$f":"IFERROR(INDEX(E$3:E$281,SMALL(IF(B$3:B$281=\"In\",ROW(E$2:E$280)-ROW(E$2)+1),ROW(E88))),\"\")","v":""},{"$f":"IFERROR(INDEX(G$3:G$281,SMALL(IF(B$3:B$281=\"In\",ROW(F$2:F$280)-ROW(F$2)+1),ROW(F88))),\"\")","v":""},{"$f":"IFERROR(INDEX(H$3:H$281,SMALL(IF(B$3:B$281=\"In\",ROW(H$2:H$280)-ROW(G$2)+1),ROW(G88))),\"\")","v":""},{"$f":"IFERROR(INDEX(I$3:I$281,SMALL(IF(B$3:B$281=\"In\",ROW(I$2:I$280)-ROW(H$2)+1),ROW(H88))),\"\")","v":""},{"$f":"IFERROR(INDEX(J$3:J$281,SMALL(IF(B$3:B$281=\"In\",ROW(J$2:J$280)-ROW(I$2)+1),ROW(I88))),\"\")","v":""},{"$f":"IFERROR(INDEX(K$3:K$281,SMALL(IF(B$3:B$281=\"In\",ROW(K$2:K$280)-ROW(J$2)+1),ROW(J88))),\"\")","v":""},{"$f":"IFERROR(INDEX(L$3:L$281,SMALL(IF(B$3:B$281=\"In\",ROW(L$2:L$280)-ROW(K$2)+1),ROW(K88))),\"\")","v":""}]
[false,"Out","FC","Mindset","N",89,"Financial confidence","Confident keeping track of income and expenditure","Perceived quality of approach to keeping track of income and expenditure","Fincap (I8)","Thinking overall about your (and your partner/spouse’s) approach to keeping track of income and expenditure, how well do you think this approach works?\n\nPlease answer on a scale of 0 to 10, where 0 means not at all well and 10 means very well\n\n0…10 scale\nDon't know",null,null,null,null,{"$f":"IFERROR(INDEX(F$3:F$281,SMALL(IF(B$3:B$281=\"In\",ROW(F$2:F$280)-ROW(F$2)+1),ROW(F89))),\"\")","v":""},{"$f":"IFERROR(INDEX(D$3:D$281,SMALL(IF(B$3:B$281=\"In\",ROW(D$2:D$280)-ROW(F$2)+1),ROW(F89))),\"\")","v":""},{"$f":"IFERROR(INDEX(E$3:E$281,SMALL(IF(B$3:B$281=\"In\",ROW(E$2:E$280)-ROW(E$2)+1),ROW(E89))),\"\")","v":""},{"$f":"IFERROR(INDEX(G$3:G$281,SMALL(IF(B$3:B$281=\"In\",ROW(F$2:F$280)-ROW(F$2)+1),ROW(F89))),\"\")","v":""},{"$f":"IFERROR(INDEX(H$3:H$281,SMALL(IF(B$3:B$281=\"In\",ROW(H$2:H$280)-ROW(G$2)+1),ROW(G89))),\"\")","v":""},{"$f":"IFERROR(INDEX(I$3:I$281,SMALL(IF(B$3:B$281=\"In\",ROW(I$2:I$280)-ROW(H$2)+1),ROW(H89))),\"\")","v":""},{"$f":"IFERROR(INDEX(J$3:J$281,SMALL(IF(B$3:B$281=\"In\",ROW(J$2:J$280)-ROW(I$2)+1),ROW(I89))),\"\")","v":""},{"$f":"IFERROR(INDEX(K$3:K$281,SMALL(IF(B$3:B$281=\"In\",ROW(K$2:K$280)-ROW(J$2)+1),ROW(J89))),\"\")","v":""},{"$f":"IFERROR(INDEX(L$3:L$281,SMALL(IF(B$3:B$281=\"In\",ROW(L$2:L$280)-ROW(K$2)+1),ROW(K89))),\"\")","v":""}]
[false,"Out","FC","Mindset","N",90,"Financial confidence","Confident exercising their own judgment in financial decisions and to question\nsuggestions and advice","Level of confidence dealing with companies and making purchases ","SEG (B1)","How much do you agree or disagree with the following statement?  \n \n- When dealing with companies or making purchases, I would consider myself to be a confident and savvy customer\n \n\n1. Strongly agree\n2. Tend to agree\n3. Neither agree nor disagree\n4. Tend to disagree\n5. Strongly disagree\n6. Don’t know\n",null,null,null,null,{"$f":"IFERROR(INDEX(F$3:F$281,SMALL(IF(B$3:B$281=\"In\",ROW(F$2:F$280)-ROW(F$2)+1),ROW(F90))),\"\")","v":""},{"$f":"IFERROR(INDEX(D$3:D$281,SMALL(IF(B$3:B$281=\"In\",ROW(D$2:D$280)-ROW(F$2)+1),ROW(F90))),\"\")","v":""},{"$f":"IFERROR(INDEX(E$3:E$281,SMALL(IF(B$3:B$281=\"In\",ROW(E$2:E$280)-ROW(E$2)+1),ROW(E90))),\"\")","v":""},{"$f":"IFERROR(INDEX(G$3:G$281,SMALL(IF(B$3:B$281=\"In\",ROW(F$2:F$280)-ROW(F$2)+1),ROW(F90))),\"\")","v":""},{"$f":"IFERROR(INDEX(H$3:H$281,SMALL(IF(B$3:B$281=\"In\",ROW(H$2:H$280)-ROW(G$2)+1),ROW(G90))),\"\")","v":""},{"$f":"IFERROR(INDEX(I$3:I$281,SMALL(IF(B$3:B$281=\"In\",ROW(I$2:I$280)-ROW(H$2)+1),ROW(H90))),\"\")","v":""},{"$f":"IFERROR(INDEX(J$3:J$281,SMALL(IF(B$3:B$281=\"In\",ROW(J$2:J$280)-ROW(I$2)+1),ROW(I90))),\"\")","v":""},{"$f":"IFERROR(INDEX(K$3:K$281,SMALL(IF(B$3:B$281=\"In\",ROW(K$2:K$280)-ROW(J$2)+1),ROW(J90))),\"\")","v":""},{"$f":"IFERROR(INDEX(L$3:L$281,SMALL(IF(B$3:B$281=\"In\",ROW(L$2:L$280)-ROW(K$2)+1),ROW(K90))),\"\")","v":""}]
[false,"Out","FC","Mindset","N",91,"Financial confidence","Confident exercising their own judgment in financial decisions and to question\nsuggestions and advice","Level of confidence making decisions about pensions","AtP (QA19,21,31)","How much do you agree or disagree with each of the following statements?  \n \n - I know enough about pensions to decide with confidence  how to save for my retirement \n - Sometimes pensions seem so complicated that I cannot really understand the best thing to do \n - Dealing with pensions scares me \n\n1. Strongly agree\n2. Tend to agree\n3. Neither agree nor disagree\n4. Tend to disagree\n5. Strongly disagree\n6. Don’t know",null,null,null,null,{"$f":"IFERROR(INDEX(F$3:F$281,SMALL(IF(B$3:B$281=\"In\",ROW(F$2:F$280)-ROW(F$2)+1),ROW(F91))),\"\")","v":""},{"$f":"IFERROR(INDEX(D$3:D$281,SMALL(IF(B$3:B$281=\"In\",ROW(D$2:D$280)-ROW(F$2)+1),ROW(F91))),\"\")","v":""},{"$f":"IFERROR(INDEX(E$3:E$281,SMALL(IF(B$3:B$281=\"In\",ROW(E$2:E$280)-ROW(E$2)+1),ROW(E91))),\"\")","v":""},{"$f":"IFERROR(INDEX(G$3:G$281,SMALL(IF(B$3:B$281=\"In\",ROW(F$2:F$280)-ROW(F$2)+1),ROW(F91))),\"\")","v":""},{"$f":"IFERROR(INDEX(H$3:H$281,SMALL(IF(B$3:B$281=\"In\",ROW(H$2:H$280)-ROW(G$2)+1),ROW(G91))),\"\")","v":""},{"$f":"IFERROR(INDEX(I$3:I$281,SMALL(IF(B$3:B$281=\"In\",ROW(I$2:I$280)-ROW(H$2)+1),ROW(H91))),\"\")","v":""},{"$f":"IFERROR(INDEX(J$3:J$281,SMALL(IF(B$3:B$281=\"In\",ROW(J$2:J$280)-ROW(I$2)+1),ROW(I91))),\"\")","v":""},{"$f":"IFERROR(INDEX(K$3:K$281,SMALL(IF(B$3:B$281=\"In\",ROW(K$2:K$280)-ROW(J$2)+1),ROW(J91))),\"\")","v":""},{"$f":"IFERROR(INDEX(L$3:L$281,SMALL(IF(B$3:B$281=\"In\",ROW(L$2:L$280)-ROW(K$2)+1),ROW(K91))),\"\")","v":""}]
[false,"Out","FC","Mindset","N",92,"Financial confidence","Confident communicating about their situation and needs with financial\nservices professionals.","Level of confidence talking to advice providers ","NEW","How confident would you feel talking to people who can give you advice about money\n\n1.Very confident \n2. Fairly confident \n3. Not very confident \n4. Not at all confident\n5. Don't know\n",null,null,null,null,{"$f":"IFERROR(INDEX(F$3:F$281,SMALL(IF(B$3:B$281=\"In\",ROW(F$2:F$280)-ROW(F$2)+1),ROW(F92))),\"\")","v":""},{"$f":"IFERROR(INDEX(D$3:D$281,SMALL(IF(B$3:B$281=\"In\",ROW(D$2:D$280)-ROW(F$2)+1),ROW(F92))),\"\")","v":""},{"$f":"IFERROR(INDEX(E$3:E$281,SMALL(IF(B$3:B$281=\"In\",ROW(E$2:E$280)-ROW(E$2)+1),ROW(E92))),\"\")","v":""},{"$f":"IFERROR(INDEX(G$3:G$281,SMALL(IF(B$3:B$281=\"In\",ROW(F$2:F$280)-ROW(F$2)+1),ROW(F92))),\"\")","v":""},{"$f":"IFERROR(INDEX(H$3:H$281,SMALL(IF(B$3:B$281=\"In\",ROW(H$2:H$280)-ROW(G$2)+1),ROW(G92))),\"\")","v":""},{"$f":"IFERROR(INDEX(I$3:I$281,SMALL(IF(B$3:B$281=\"In\",ROW(I$2:I$280)-ROW(H$2)+1),ROW(H92))),\"\")","v":""},{"$f":"IFERROR(INDEX(J$3:J$281,SMALL(IF(B$3:B$281=\"In\",ROW(J$2:J$280)-ROW(I$2)+1),ROW(I92))),\"\")","v":""},{"$f":"IFERROR(INDEX(K$3:K$281,SMALL(IF(B$3:B$281=\"In\",ROW(K$2:K$280)-ROW(J$2)+1),ROW(J92))),\"\")","v":""},{"$f":"IFERROR(INDEX(L$3:L$281,SMALL(IF(B$3:B$281=\"In\",ROW(L$2:L$280)-ROW(K$2)+1),ROW(K92))),\"\")","v":""}]
[false,"Out","FC","Mindset","N",93,"Financial confidence"," ","Extent of feeling in control of financial situation\n","NEW","How much do you agree or disagree with each of the following statements?  \n \n - I feel in control of my finances\n\n1. Strongly agree\n2. Tend to agree\n3. Neither agree nor disagree\n4. Tend to disagree\n5. Strongly disagree\n6. Don’t know\n \n",null,null,null,null,{"$f":"IFERROR(INDEX(F$3:F$281,SMALL(IF(B$3:B$281=\"In\",ROW(F$2:F$280)-ROW(F$2)+1),ROW(F93))),\"\")","v":""},{"$f":"IFERROR(INDEX(D$3:D$281,SMALL(IF(B$3:B$281=\"In\",ROW(D$2:D$280)-ROW(F$2)+1),ROW(F93))),\"\")","v":""},{"$f":"IFERROR(INDEX(E$3:E$281,SMALL(IF(B$3:B$281=\"In\",ROW(E$2:E$280)-ROW(E$2)+1),ROW(E93))),\"\")","v":""},{"$f":"IFERROR(INDEX(G$3:G$281,SMALL(IF(B$3:B$281=\"In\",ROW(F$2:F$280)-ROW(F$2)+1),ROW(F93))),\"\")","v":""},{"$f":"IFERROR(INDEX(H$3:H$281,SMALL(IF(B$3:B$281=\"In\",ROW(H$2:H$280)-ROW(G$2)+1),ROW(G93))),\"\")","v":""},{"$f":"IFERROR(INDEX(I$3:I$281,SMALL(IF(B$3:B$281=\"In\",ROW(I$2:I$280)-ROW(H$2)+1),ROW(H93))),\"\")","v":""},{"$f":"IFERROR(INDEX(J$3:J$281,SMALL(IF(B$3:B$281=\"In\",ROW(J$2:J$280)-ROW(I$2)+1),ROW(I93))),\"\")","v":""},{"$f":"IFERROR(INDEX(K$3:K$281,SMALL(IF(B$3:B$281=\"In\",ROW(K$2:K$280)-ROW(J$2)+1),ROW(J93))),\"\")","v":""},{"$f":"IFERROR(INDEX(L$3:L$281,SMALL(IF(B$3:B$281=\"In\",ROW(L$2:L$280)-ROW(K$2)+1),ROW(K93))),\"\")","v":""}]
[false,"Out","SSC","Mindset","Y",94,"Spending self-control",null,"Level of self-control over spending","Fincap (O4a)","O4 To what extent would you say the following statements apply to you personally?\n\n\"I often buy things on impulse\"\n\"I feel under pressure to spend like my friends even when I can’t afford it\"\n\"I run short of money because I overspend\"\n\"I tend to buy things even when I can’t really afford them\"\n\"I find it more satisfying to spend money than to save it\"\n\n\n\n0 does not sound like me\n...\n10 sounds a lot like me\nDon't know\nNot applicable",null,null,null,null,{"$f":"IFERROR(INDEX(F$3:F$281,SMALL(IF(B$3:B$281=\"In\",ROW(F$2:F$280)-ROW(F$2)+1),ROW(F94))),\"\")","v":""},{"$f":"IFERROR(INDEX(D$3:D$281,SMALL(IF(B$3:B$281=\"In\",ROW(D$2:D$280)-ROW(F$2)+1),ROW(F94))),\"\")","v":""},{"$f":"IFERROR(INDEX(E$3:E$281,SMALL(IF(B$3:B$281=\"In\",ROW(E$2:E$280)-ROW(E$2)+1),ROW(E94))),\"\")","v":""},{"$f":"IFERROR(INDEX(G$3:G$281,SMALL(IF(B$3:B$281=\"In\",ROW(F$2:F$280)-ROW(F$2)+1),ROW(F94))),\"\")","v":""},{"$f":"IFERROR(INDEX(H$3:H$281,SMALL(IF(B$3:B$281=\"In\",ROW(H$2:H$280)-ROW(G$2)+1),ROW(G94))),\"\")","v":""},{"$f":"IFERROR(INDEX(I$3:I$281,SMALL(IF(B$3:B$281=\"In\",ROW(I$2:I$280)-ROW(H$2)+1),ROW(H94))),\"\")","v":""},{"$f":"IFERROR(INDEX(J$3:J$281,SMALL(IF(B$3:B$281=\"In\",ROW(J$2:J$280)-ROW(I$2)+1),ROW(I94))),\"\")","v":""},{"$f":"IFERROR(INDEX(K$3:K$281,SMALL(IF(B$3:B$281=\"In\",ROW(K$2:K$280)-ROW(J$2)+1),ROW(J94))),\"\")","v":""},{"$f":"IFERROR(INDEX(L$3:L$281,SMALL(IF(B$3:B$281=\"In\",ROW(L$2:L$280)-ROW(K$2)+1),ROW(K94))),\"\")","v":""}]
[null,null,null,null,"Y",95,"Spending self-control"," ","Ability to resist pressures to spend","Fincap (O4c)","O4 To what extent would you say the following statements apply to you personally?B) I feel under pressure to spend like my friends even when I can’t afford it.0 (does not sound like me at all) to 10 (sounds a lot like me)  0 does not sound like me...10 sounds a lot like meDon't knowNot applicable",null,null,null,null,{"$f":"IFERROR(INDEX(F$3:F$281,SMALL(IF(B$3:B$281=\"In\",ROW(F$2:F$280)-ROW(F$2)+1),ROW(F95))),\"\")","v":""},{"$f":"IFERROR(INDEX(D$3:D$281,SMALL(IF(B$3:B$281=\"In\",ROW(D$2:D$280)-ROW(F$2)+1),ROW(F95))),\"\")","v":""},{"$f":"IFERROR(INDEX(E$3:E$281,SMALL(IF(B$3:B$281=\"In\",ROW(E$2:E$280)-ROW(E$2)+1),ROW(E95))),\"\")","v":""},{"$f":"IFERROR(INDEX(G$3:G$281,SMALL(IF(B$3:B$281=\"In\",ROW(F$2:F$280)-ROW(F$2)+1),ROW(F95))),\"\")","v":""},{"$f":"IFERROR(INDEX(H$3:H$281,SMALL(IF(B$3:B$281=\"In\",ROW(H$2:H$280)-ROW(G$2)+1),ROW(G95))),\"\")","v":""},{"$f":"IFERROR(INDEX(I$3:I$281,SMALL(IF(B$3:B$281=\"In\",ROW(I$2:I$280)-ROW(H$2)+1),ROW(H95))),\"\")","v":""},{"$f":"IFERROR(INDEX(J$3:J$281,SMALL(IF(B$3:B$281=\"In\",ROW(J$2:J$280)-ROW(I$2)+1),ROW(I95))),\"\")","v":""},{"$f":"IFERROR(INDEX(K$3:K$281,SMALL(IF(B$3:B$281=\"In\",ROW(K$2:K$280)-ROW(J$2)+1),ROW(J95))),\"\")","v":""},{"$f":"IFERROR(INDEX(L$3:L$281,SMALL(IF(B$3:B$281=\"In\",ROW(L$2:L$280)-ROW(K$2)+1),ROW(K95))),\"\")","v":""}]
[null,null,null,null,"Y",96,"Spending self-control","I run short of money because I overspend",null,"Norb8","To what extent would you say the following statements apply to you personally?\nI run short of money because I overspend\nPlease answer on a scale of 0 to 10, where 0 means it doesn’t sound like you at all and\n10 means it sounds a lot like you\n1. 0 Does not sound like me at all\n2. 1\n3. 2\n4. 3\n5. 4\n6. 5\n7. 6\n8. 7\n9. 8\n10. 9\n11. 10 Sounds a lot like me\n12. Don’t know\n13. Not applicable",null,null,null,null,{"$f":"IFERROR(INDEX(F$3:F$281,SMALL(IF(B$3:B$281=\"In\",ROW(F$2:F$280)-ROW(F$2)+1),ROW(F96))),\"\")","v":""},{"$f":"IFERROR(INDEX(D$3:D$281,SMALL(IF(B$3:B$281=\"In\",ROW(D$2:D$280)-ROW(F$2)+1),ROW(F96))),\"\")","v":""},{"$f":"IFERROR(INDEX(E$3:E$281,SMALL(IF(B$3:B$281=\"In\",ROW(E$2:E$280)-ROW(E$2)+1),ROW(E96))),\"\")","v":""},{"$f":"IFERROR(INDEX(G$3:G$281,SMALL(IF(B$3:B$281=\"In\",ROW(F$2:F$280)-ROW(F$2)+1),ROW(F96))),\"\")","v":""},{"$f":"IFERROR(INDEX(H$3:H$281,SMALL(IF(B$3:B$281=\"In\",ROW(H$2:H$280)-ROW(G$2)+1),ROW(G96))),\"\")","v":""},{"$f":"IFERROR(INDEX(I$3:I$281,SMALL(IF(B$3:B$281=\"In\",ROW(I$2:I$280)-ROW(H$2)+1),ROW(H96))),\"\")","v":""},{"$f":"IFERROR(INDEX(J$3:J$281,SMALL(IF(B$3:B$281=\"In\",ROW(J$2:J$280)-ROW(I$2)+1),ROW(I96))),\"\")","v":""},{"$f":"IFERROR(INDEX(K$3:K$281,SMALL(IF(B$3:B$281=\"In\",ROW(K$2:K$280)-ROW(J$2)+1),ROW(J96))),\"\")","v":""},{"$f":"IFERROR(INDEX(L$3:L$281,SMALL(IF(B$3:B$281=\"In\",ROW(L$2:L$280)-ROW(K$2)+1),ROW(K96))),\"\")","v":""}]
[null,null,null,null,"Y",97,"Spending self-control","I tend to buy things even when I can't really afford them",null,null,"To what extent would you say the following statements apply to you personally?\nI tend to buy things even when I can’t really afford them.\nPlease answer on a scale of 0 to 10, where 0 means it doesn’t sound like you at all and\n10 means it sounds a lot like you\n1. 0 Does not sound like me at all\n2. 1\n3. 2\n4. 3\n5. 4\n6. 5\n7. 6\n8. 7\n9. 8\n10. 9\n11. 10 Sounds a lot like me\n12. Don’t know\n13. Not applicable",null,null,null,null,{"$f":"IFERROR(INDEX(F$3:F$281,SMALL(IF(B$3:B$281=\"In\",ROW(F$2:F$280)-ROW(F$2)+1),ROW(F97))),\"\")","v":""},{"$f":"IFERROR(INDEX(D$3:D$281,SMALL(IF(B$3:B$281=\"In\",ROW(D$2:D$280)-ROW(F$2)+1),ROW(F97))),\"\")","v":""},{"$f":"IFERROR(INDEX(E$3:E$281,SMALL(IF(B$3:B$281=\"In\",ROW(E$2:E$280)-ROW(E$2)+1),ROW(E97))),\"\")","v":""},{"$f":"IFERROR(INDEX(G$3:G$281,SMALL(IF(B$3:B$281=\"In\",ROW(F$2:F$280)-ROW(F$2)+1),ROW(F97))),\"\")","v":""},{"$f":"IFERROR(INDEX(H$3:H$281,SMALL(IF(B$3:B$281=\"In\",ROW(H$2:H$280)-ROW(G$2)+1),ROW(G97))),\"\")","v":""},{"$f":"IFERROR(INDEX(I$3:I$281,SMALL(IF(B$3:B$281=\"In\",ROW(I$2:I$280)-ROW(H$2)+1),ROW(H97))),\"\")","v":""},{"$f":"IFERROR(INDEX(J$3:J$281,SMALL(IF(B$3:B$281=\"In\",ROW(J$2:J$280)-ROW(I$2)+1),ROW(I97))),\"\")","v":""},{"$f":"IFERROR(INDEX(K$3:K$281,SMALL(IF(B$3:B$281=\"In\",ROW(K$2:K$280)-ROW(J$2)+1),ROW(J97))),\"\")","v":""},{"$f":"IFERROR(INDEX(L$3:L$281,SMALL(IF(B$3:B$281=\"In\",ROW(L$2:L$280)-ROW(K$2)+1),ROW(K97))),\"\")","v":""}]
[null,null,null,null,"Y",98,"Spending self-control","I find it more satisfying to spend money than to save it",null,null,"To what extent would you say the following statements apply to you personally?\n I find it more satisfying to spend money than to save it \nPlease answer on a scale of 0 to 10, where 0 means it doesn’t sound like you at all and\n10 means it sounds a lot like you\n1. 0 Does not sound like me at all\n2. 1\n3. 2\n4. 3\n5. 4\n6. 5\n7. 6\n8. 7\n9. 8\n10. 9\n11. 10 Sounds a lot like me\n12. Don’t know\n13. Not applicable",null,null,null,null,{"$f":"IFERROR(INDEX(F$3:F$281,SMALL(IF(B$3:B$281=\"In\",ROW(F$2:F$280)-ROW(F$2)+1),ROW(F98))),\"\")","v":""},{"$f":"IFERROR(INDEX(D$3:D$281,SMALL(IF(B$3:B$281=\"In\",ROW(D$2:D$280)-ROW(F$2)+1),ROW(F98))),\"\")","v":""},{"$f":"IFERROR(INDEX(E$3:E$281,SMALL(IF(B$3:B$281=\"In\",ROW(E$2:E$280)-ROW(E$2)+1),ROW(E98))),\"\")","v":""},{"$f":"IFERROR(INDEX(G$3:G$281,SMALL(IF(B$3:B$281=\"In\",ROW(F$2:F$280)-ROW(F$2)+1),ROW(F98))),\"\")","v":""},{"$f":"IFERROR(INDEX(H$3:H$281,SMALL(IF(B$3:B$281=\"In\",ROW(H$2:H$280)-ROW(G$2)+1),ROW(G98))),\"\")","v":""},{"$f":"IFERROR(INDEX(I$3:I$281,SMALL(IF(B$3:B$281=\"In\",ROW(I$2:I$280)-ROW(H$2)+1),ROW(H98))),\"\")","v":""},{"$f":"IFERROR(INDEX(J$3:J$281,SMALL(IF(B$3:B$281=\"In\",ROW(J$2:J$280)-ROW(I$2)+1),ROW(I98))),\"\")","v":""},{"$f":"IFERROR(INDEX(K$3:K$281,SMALL(IF(B$3:B$281=\"In\",ROW(K$2:K$280)-ROW(J$2)+1),ROW(J98))),\"\")","v":""},{"$f":"IFERROR(INDEX(L$3:L$281,SMALL(IF(B$3:B$281=\"In\",ROW(L$2:L$280)-ROW(K$2)+1),ROW(K98))),\"\")","v":""}]
[false,{"$f":"IF(A101=TRUE,\"In\",\"Out\")","v":"Out"},"EWM","Mindset","Y",99,"Engagement with money"," ","Extent of engagement with money","Fincap O2D","To what extent do you agree or disagree with the\nstatement \n\n\"When it comes to money I prefer to live for today\nrather than plan for tomorrow -\" \n \"Nothing I do will make much difference to my financial situation\"\n\"I am too busy to sort out my finances at the moment\"\n\n1. Strongly agree\n2. Tend to agree\n3. Neither agree nor disagree\n4. Tend to disagree\n5. Strongly disagree\n6. Don’t know\n",null,null,null,null,{"$f":"IFERROR(INDEX(F$3:F$281,SMALL(IF(B$3:B$281=\"In\",ROW(F$2:F$280)-ROW(F$2)+1),ROW(F99))),\"\")","v":""},{"$f":"IFERROR(INDEX(D$3:D$281,SMALL(IF(B$3:B$281=\"In\",ROW(D$2:D$280)-ROW(F$2)+1),ROW(F99))),\"\")","v":""},{"$f":"IFERROR(INDEX(E$3:E$281,SMALL(IF(B$3:B$281=\"In\",ROW(E$2:E$280)-ROW(E$2)+1),ROW(E99))),\"\")","v":""},{"$f":"IFERROR(INDEX(G$3:G$281,SMALL(IF(B$3:B$281=\"In\",ROW(F$2:F$280)-ROW(F$2)+1),ROW(F99))),\"\")","v":""},{"$f":"IFERROR(INDEX(H$3:H$281,SMALL(IF(B$3:B$281=\"In\",ROW(H$2:H$280)-ROW(G$2)+1),ROW(G99))),\"\")","v":""},{"$f":"IFERROR(INDEX(I$3:I$281,SMALL(IF(B$3:B$281=\"In\",ROW(I$2:I$280)-ROW(H$2)+1),ROW(H99))),\"\")","v":""},{"$f":"IFERROR(INDEX(J$3:J$281,SMALL(IF(B$3:B$281=\"In\",ROW(J$2:J$280)-ROW(I$2)+1),ROW(I99))),\"\")","v":""},{"$f":"IFERROR(INDEX(K$3:K$281,SMALL(IF(B$3:B$281=\"In\",ROW(K$2:K$280)-ROW(J$2)+1),ROW(J99))),\"\")","v":""},{"$f":"IFERROR(INDEX(L$3:L$281,SMALL(IF(B$3:B$281=\"In\",ROW(L$2:L$280)-ROW(K$2)+1),ROW(K99))),\"\")","v":""}]
[false,"Out","EWM","Mindset","Y",100,"Engagement with money",null,"Extent of engagement with money","Norway (adapted) norf3","To what extent would you say the following statements apply to you personally? When it comes to money, the future will take care of itself. \nPlease answer on a scale of 0 to 10, where 0 means it doesn’t sound like you at all and 10 means it sounds a lot like you \n1. 0 Does not sound like me at all \n2. 1 \n3. 2 \n4. 3 \n5. 4\n6. 5 \n7. 6 \n8. 7 \n9. 8 \n10. 9 \n11. 10 Sounds a lot like me",null,null,null,null,{"$f":"IFERROR(INDEX(F$3:F$281,SMALL(IF(B$3:B$281=\"In\",ROW(F$2:F$280)-ROW(F$2)+1),ROW(F100))),\"\")","v":""},{"$f":"IFERROR(INDEX(D$3:D$281,SMALL(IF(B$3:B$281=\"In\",ROW(D$2:D$280)-ROW(F$2)+1),ROW(F100))),\"\")","v":""},{"$f":"IFERROR(INDEX(E$3:E$281,SMALL(IF(B$3:B$281=\"In\",ROW(E$2:E$280)-ROW(E$2)+1),ROW(E100))),\"\")","v":""},{"$f":"IFERROR(INDEX(G$3:G$281,SMALL(IF(B$3:B$281=\"In\",ROW(F$2:F$280)-ROW(F$2)+1),ROW(F100))),\"\")","v":""},{"$f":"IFERROR(INDEX(H$3:H$281,SMALL(IF(B$3:B$281=\"In\",ROW(H$2:H$280)-ROW(G$2)+1),ROW(G100))),\"\")","v":""},{"$f":"IFERROR(INDEX(I$3:I$281,SMALL(IF(B$3:B$281=\"In\",ROW(I$2:I$280)-ROW(H$2)+1),ROW(H100))),\"\")","v":""},{"$f":"IFERROR(INDEX(J$3:J$281,SMALL(IF(B$3:B$281=\"In\",ROW(J$2:J$280)-ROW(I$2)+1),ROW(I100))),\"\")","v":""},{"$f":"IFERROR(INDEX(K$3:K$281,SMALL(IF(B$3:B$281=\"In\",ROW(K$2:K$280)-ROW(J$2)+1),ROW(J100))),\"\")","v":""},{"$f":"IFERROR(INDEX(L$3:L$281,SMALL(IF(B$3:B$281=\"In\",ROW(L$2:L$280)-ROW(K$2)+1),ROW(K100))),\"\")","v":""}]
[false,"Out","EWTF","Mindset","Y",101,"Engagement with the future",null,"Extent of engagement with the future","norf1","To what extent would you say the following statements apply to you personally?\n\n\n\"When it comes to money, I focus on the long term\"\n\"When I make financial plans I do everything I can to succeed\"\n\"When it comes to money, I can pretty much determine what happens in my life\"\n\n\nPlease answer on a scale of 0 to 10, where 0 means it doesn’t sound like you at all and 10\nmeans it sounds a lot like you\n1. 0 Does not sound like me at all\n2. 1\n3. 2\n4. 3\n5. 4\n6. 5\n7. 6\n8. 7\n9. 8\n10. 9\n11. 10 Sounds a lot like me",null,null,null,null,{"$f":"IFERROR(INDEX(F$3:F$281,SMALL(IF(B$3:B$281=\"In\",ROW(F$2:F$280)-ROW(F$2)+1),ROW(F101))),\"\")","v":""},{"$f":"IFERROR(INDEX(D$3:D$281,SMALL(IF(B$3:B$281=\"In\",ROW(D$2:D$280)-ROW(F$2)+1),ROW(F101))),\"\")","v":""},{"$f":"IFERROR(INDEX(E$3:E$281,SMALL(IF(B$3:B$281=\"In\",ROW(E$2:E$280)-ROW(E$2)+1),ROW(E101))),\"\")","v":""},{"$f":"IFERROR(INDEX(G$3:G$281,SMALL(IF(B$3:B$281=\"In\",ROW(F$2:F$280)-ROW(F$2)+1),ROW(F101))),\"\")","v":""},{"$f":"IFERROR(INDEX(H$3:H$281,SMALL(IF(B$3:B$281=\"In\",ROW(H$2:H$280)-ROW(G$2)+1),ROW(G101))),\"\")","v":""},{"$f":"IFERROR(INDEX(I$3:I$281,SMALL(IF(B$3:B$281=\"In\",ROW(I$2:I$280)-ROW(H$2)+1),ROW(H101))),\"\")","v":""},{"$f":"IFERROR(INDEX(J$3:J$281,SMALL(IF(B$3:B$281=\"In\",ROW(J$2:J$280)-ROW(I$2)+1),ROW(I101))),\"\")","v":""},{"$f":"IFERROR(INDEX(K$3:K$281,SMALL(IF(B$3:B$281=\"In\",ROW(K$2:K$280)-ROW(J$2)+1),ROW(J101))),\"\")","v":""},{"$f":"IFERROR(INDEX(L$3:L$281,SMALL(IF(B$3:B$281=\"In\",ROW(L$2:L$280)-ROW(K$2)+1),ROW(K101))),\"\")","v":""}]
[null,null,null,null,"Y",102,"Engagement with the future","When it comes to money, I make financial plans I do everything I can to succeed",null,"norf15","To what extent would you say the following statements apply to you personally?When I make financial plans I do everything I can to succeedPlease answer on a scale of 0 to 10, where 0 means it doesn’t sound like you at all and10 means it sounds a lot like you1. 0 Does not sound like me at all2. 13. 24. 35. 46. 57. 68. 79. 810. 911. 10 Sounds a lot like me12. Don’t know13. Not applicable",null,null,null,null,{"$f":"IFERROR(INDEX(F$3:F$281,SMALL(IF(B$3:B$281=\"In\",ROW(F$2:F$280)-ROW(F$2)+1),ROW(F102))),\"\")","v":""},{"$f":"IFERROR(INDEX(D$3:D$281,SMALL(IF(B$3:B$281=\"In\",ROW(D$2:D$280)-ROW(F$2)+1),ROW(F102))),\"\")","v":""},{"$f":"IFERROR(INDEX(E$3:E$281,SMALL(IF(B$3:B$281=\"In\",ROW(E$2:E$280)-ROW(E$2)+1),ROW(E102))),\"\")","v":""},{"$f":"IFERROR(INDEX(G$3:G$281,SMALL(IF(B$3:B$281=\"In\",ROW(F$2:F$280)-ROW(F$2)+1),ROW(F102))),\"\")","v":""},{"$f":"IFERROR(INDEX(H$3:H$281,SMALL(IF(B$3:B$281=\"In\",ROW(H$2:H$280)-ROW(G$2)+1),ROW(G102))),\"\")","v":""},{"$f":"IFERROR(INDEX(I$3:I$281,SMALL(IF(B$3:B$281=\"In\",ROW(I$2:I$280)-ROW(H$2)+1),ROW(H102))),\"\")","v":""},{"$f":"IFERROR(INDEX(J$3:J$281,SMALL(IF(B$3:B$281=\"In\",ROW(J$2:J$280)-ROW(I$2)+1),ROW(I102))),\"\")","v":""},{"$f":"IFERROR(INDEX(K$3:K$281,SMALL(IF(B$3:B$281=\"In\",ROW(K$2:K$280)-ROW(J$2)+1),ROW(J102))),\"\")","v":""},{"$f":"IFERROR(INDEX(L$3:L$281,SMALL(IF(B$3:B$281=\"In\",ROW(L$2:L$280)-ROW(K$2)+1),ROW(K102))),\"\")","v":""}]
[null,null,null,null,"Y",103,"Engagement with the future","When it comes to money, I can pretty much determine what happens in my life",null,"norf13","To what extent would you say the following statements apply to you personally? \nWhen it comes to money, I can pretty much determine what happens in my life.Please answer on a scale of 0 to 10, where 0 means it doesn’t sound like you at all and10 means it sounds a lot like you1. 0 Does not sound like me at all2. 13. 24. 35. 46. 57. 68. 79. 810. 911. 10 Sounds a lot like me12. Don’t know13. Not applicable",null,null,null,null,{"$f":"IFERROR(INDEX(F$3:F$281,SMALL(IF(B$3:B$281=\"In\",ROW(F$2:F$280)-ROW(F$2)+1),ROW(F103))),\"\")","v":""},{"$f":"IFERROR(INDEX(D$3:D$281,SMALL(IF(B$3:B$281=\"In\",ROW(D$2:D$280)-ROW(F$2)+1),ROW(F103))),\"\")","v":""},{"$f":"IFERROR(INDEX(E$3:E$281,SMALL(IF(B$3:B$281=\"In\",ROW(E$2:E$280)-ROW(E$2)+1),ROW(E103))),\"\")","v":""},{"$f":"IFERROR(INDEX(G$3:G$281,SMALL(IF(B$3:B$281=\"In\",ROW(F$2:F$280)-ROW(F$2)+1),ROW(F103))),\"\")","v":""},{"$f":"IFERROR(INDEX(H$3:H$281,SMALL(IF(B$3:B$281=\"In\",ROW(H$2:H$280)-ROW(G$2)+1),ROW(G103))),\"\")","v":""},{"$f":"IFERROR(INDEX(I$3:I$281,SMALL(IF(B$3:B$281=\"In\",ROW(I$2:I$280)-ROW(H$2)+1),ROW(H103))),\"\")","v":""},{"$f":"IFERROR(INDEX(J$3:J$281,SMALL(IF(B$3:B$281=\"In\",ROW(J$2:J$280)-ROW(I$2)+1),ROW(I103))),\"\")","v":""},{"$f":"IFERROR(INDEX(K$3:K$281,SMALL(IF(B$3:B$281=\"In\",ROW(K$2:K$280)-ROW(J$2)+1),ROW(J103))),\"\")","v":""},{"$f":"IFERROR(INDEX(L$3:L$281,SMALL(IF(B$3:B$281=\"In\",ROW(L$2:L$280)-ROW(K$2)+1),ROW(K103))),\"\")","v":""}]
[false,{"$f":"IF(A106=TRUE,\"In\",\"Out\")","v":"Out"},"CFR","Mindset","Y",104,"Confidence for retirement","Understand enough to make decisions about retirement",null,"WAS wasou","Do you agree or disagree ….?\n\nI feel I understand enough about pensions to make decisions about saving for\nretirement\n\n1. Strongly agree\n2. Tend to agree\n3. Neither agree nor disagree\n4. Tend to disagree\n5. Strongly disagree\n6. Don’t know",null,null,null,null,{"$f":"IFERROR(INDEX(F$3:F$281,SMALL(IF(B$3:B$281=\"In\",ROW(F$2:F$280)-ROW(F$2)+1),ROW(F104))),\"\")","v":""},{"$f":"IFERROR(INDEX(D$3:D$281,SMALL(IF(B$3:B$281=\"In\",ROW(D$2:D$280)-ROW(F$2)+1),ROW(F104))),\"\")","v":""},{"$f":"IFERROR(INDEX(E$3:E$281,SMALL(IF(B$3:B$281=\"In\",ROW(E$2:E$280)-ROW(E$2)+1),ROW(E104))),\"\")","v":""},{"$f":"IFERROR(INDEX(G$3:G$281,SMALL(IF(B$3:B$281=\"In\",ROW(F$2:F$280)-ROW(F$2)+1),ROW(F104))),\"\")","v":""},{"$f":"IFERROR(INDEX(H$3:H$281,SMALL(IF(B$3:B$281=\"In\",ROW(H$2:H$280)-ROW(G$2)+1),ROW(G104))),\"\")","v":""},{"$f":"IFERROR(INDEX(I$3:I$281,SMALL(IF(B$3:B$281=\"In\",ROW(I$2:I$280)-ROW(H$2)+1),ROW(H104))),\"\")","v":""},{"$f":"IFERROR(INDEX(J$3:J$281,SMALL(IF(B$3:B$281=\"In\",ROW(J$2:J$280)-ROW(I$2)+1),ROW(I104))),\"\")","v":""},{"$f":"IFERROR(INDEX(K$3:K$281,SMALL(IF(B$3:B$281=\"In\",ROW(K$2:K$280)-ROW(J$2)+1),ROW(J104))),\"\")","v":""},{"$f":"IFERROR(INDEX(L$3:L$281,SMALL(IF(B$3:B$281=\"In\",ROW(L$2:L$280)-ROW(K$2)+1),ROW(K104))),\"\")","v":""}]
[false,"Out","CFR","Mindset","Y",105,"Confidence for retirement","How much of an idea about financial situation when retire",null,"FinCap 2018 D8","How much of an idea do you have about what your financial situation will be in retirement? \n\n1. Very good idea \n2. Fairly good idea \n3. Not much idea \n4. No idea at all \n5. Don’t know",null,null,null,null,{"$f":"IFERROR(INDEX(F$3:F$281,SMALL(IF(B$3:B$281=\"In\",ROW(F$2:F$280)-ROW(F$2)+1),ROW(F105))),\"\")","v":""},{"$f":"IFERROR(INDEX(D$3:D$281,SMALL(IF(B$3:B$281=\"In\",ROW(D$2:D$280)-ROW(F$2)+1),ROW(F105))),\"\")","v":""},{"$f":"IFERROR(INDEX(E$3:E$281,SMALL(IF(B$3:B$281=\"In\",ROW(E$2:E$280)-ROW(E$2)+1),ROW(E105))),\"\")","v":""},{"$f":"IFERROR(INDEX(G$3:G$281,SMALL(IF(B$3:B$281=\"In\",ROW(F$2:F$280)-ROW(F$2)+1),ROW(F105))),\"\")","v":""},{"$f":"IFERROR(INDEX(H$3:H$281,SMALL(IF(B$3:B$281=\"In\",ROW(H$2:H$280)-ROW(G$2)+1),ROW(G105))),\"\")","v":""},{"$f":"IFERROR(INDEX(I$3:I$281,SMALL(IF(B$3:B$281=\"In\",ROW(I$2:I$280)-ROW(H$2)+1),ROW(H105))),\"\")","v":""},{"$f":"IFERROR(INDEX(J$3:J$281,SMALL(IF(B$3:B$281=\"In\",ROW(J$2:J$280)-ROW(I$2)+1),ROW(I105))),\"\")","v":""},{"$f":"IFERROR(INDEX(K$3:K$281,SMALL(IF(B$3:B$281=\"In\",ROW(K$2:K$280)-ROW(J$2)+1),ROW(J105))),\"\")","v":""},{"$f":"IFERROR(INDEX(L$3:L$281,SMALL(IF(B$3:B$281=\"In\",ROW(L$2:L$280)-ROW(K$2)+1),ROW(K105))),\"\")","v":""}]
[false,"Out","CFR","Mindset","Y",106,"Confidence for retirement","How confident planning for your financial future",null,"FinCap 2018 B6 - Adapted from Norway","How confident do you feel planning for your financial future?\nPlease answer on a scale of 0 to 10, where 0 is ‘not at all confident and 10 is ‘very\nconfident\n\n1. 0 Not at all confident\n2. 1\n3. 2\n4. 3\n5. 4\n6. 5\n7. 6\n8. 7\n9. 8\n10. 9\n11. 10 Very confident\n12. Don’t know\n",null,null,null,null,{"$f":"IFERROR(INDEX(F$3:F$281,SMALL(IF(B$3:B$281=\"In\",ROW(F$2:F$280)-ROW(F$2)+1),ROW(F106))),\"\")","v":""},{"$f":"IFERROR(INDEX(D$3:D$281,SMALL(IF(B$3:B$281=\"In\",ROW(D$2:D$280)-ROW(F$2)+1),ROW(F106))),\"\")","v":""},{"$f":"IFERROR(INDEX(E$3:E$281,SMALL(IF(B$3:B$281=\"In\",ROW(E$2:E$280)-ROW(E$2)+1),ROW(E106))),\"\")","v":""},{"$f":"IFERROR(INDEX(G$3:G$281,SMALL(IF(B$3:B$281=\"In\",ROW(F$2:F$280)-ROW(F$2)+1),ROW(F106))),\"\")","v":""},{"$f":"IFERROR(INDEX(H$3:H$281,SMALL(IF(B$3:B$281=\"In\",ROW(H$2:H$280)-ROW(G$2)+1),ROW(G106))),\"\")","v":""},{"$f":"IFERROR(INDEX(I$3:I$281,SMALL(IF(B$3:B$281=\"In\",ROW(I$2:I$280)-ROW(H$2)+1),ROW(H106))),\"\")","v":""},{"$f":"IFERROR(INDEX(J$3:J$281,SMALL(IF(B$3:B$281=\"In\",ROW(J$2:J$280)-ROW(I$2)+1),ROW(I106))),\"\")","v":""},{"$f":"IFERROR(INDEX(K$3:K$281,SMALL(IF(B$3:B$281=\"In\",ROW(K$2:K$280)-ROW(J$2)+1),ROW(J106))),\"\")","v":""},{"$f":"IFERROR(INDEX(L$3:L$281,SMALL(IF(B$3:B$281=\"In\",ROW(L$2:L$280)-ROW(K$2)+1),ROW(K106))),\"\")","v":""}]
[false,"Out","WTTAM","Mindset","N",107,"Willing to talk openly and honestly about money with friends and family"," ","Willingness to talk about money with friends and family\n","IDL/SEG Q3","How much do you agree or disagree with each of the following statements?  \n\n - I would be too embarrassed to discuss my financial situation\n \n- I would talk to family and friends before making an important financial decision\n\n1. Strongly agree\n2. Tend to agree\n3. Neither agree nor disagree\n4. Tend to disagree\n5. Strongly disagree\n6. Don’t know\n",null,null,null,null,{"$f":"IFERROR(INDEX(F$3:F$281,SMALL(IF(B$3:B$281=\"In\",ROW(F$2:F$280)-ROW(F$2)+1),ROW(F107))),\"\")","v":""},{"$f":"IFERROR(INDEX(D$3:D$281,SMALL(IF(B$3:B$281=\"In\",ROW(D$2:D$280)-ROW(F$2)+1),ROW(F107))),\"\")","v":""},{"$f":"IFERROR(INDEX(E$3:E$281,SMALL(IF(B$3:B$281=\"In\",ROW(E$2:E$280)-ROW(E$2)+1),ROW(E107))),\"\")","v":""},{"$f":"IFERROR(INDEX(G$3:G$281,SMALL(IF(B$3:B$281=\"In\",ROW(F$2:F$280)-ROW(F$2)+1),ROW(F107))),\"\")","v":""},{"$f":"IFERROR(INDEX(H$3:H$281,SMALL(IF(B$3:B$281=\"In\",ROW(H$2:H$280)-ROW(G$2)+1),ROW(G107))),\"\")","v":""},{"$f":"IFERROR(INDEX(I$3:I$281,SMALL(IF(B$3:B$281=\"In\",ROW(I$2:I$280)-ROW(H$2)+1),ROW(H107))),\"\")","v":""},{"$f":"IFERROR(INDEX(J$3:J$281,SMALL(IF(B$3:B$281=\"In\",ROW(J$2:J$280)-ROW(I$2)+1),ROW(I107))),\"\")","v":""},{"$f":"IFERROR(INDEX(K$3:K$281,SMALL(IF(B$3:B$281=\"In\",ROW(K$2:K$280)-ROW(J$2)+1),ROW(J107))),\"\")","v":""},{"$f":"IFERROR(INDEX(L$3:L$281,SMALL(IF(B$3:B$281=\"In\",ROW(L$2:L$280)-ROW(K$2)+1),ROW(K107))),\"\")","v":""}]
[null,null,null,null,"N",108,"Attitudes to the future ","Recognise the importance of balancing their future financial needs with their current financial needs ","Preference for saving for the future rather than spending now","OECD (f10)/SEG (c44)/ SEG (d35)/BASE (qpla4)","How much do you agree or disagree with each of the following statements?   - I find it more satisfying to spend money than to save it for the long term  - If I had to choose, I would rather have a good standard of living today than save for the future.1. Strongly agree2. Tend to agree3. Neither agree nor disagree4. Tend to disagree5. Strongly disagree6. Don’t know",null,null,null,null,{"$f":"IFERROR(INDEX(F$3:F$281,SMALL(IF(B$3:B$281=\"In\",ROW(F$2:F$280)-ROW(F$2)+1),ROW(F108))),\"\")","v":""},{"$f":"IFERROR(INDEX(D$3:D$281,SMALL(IF(B$3:B$281=\"In\",ROW(D$2:D$280)-ROW(F$2)+1),ROW(F108))),\"\")","v":""},{"$f":"IFERROR(INDEX(E$3:E$281,SMALL(IF(B$3:B$281=\"In\",ROW(E$2:E$280)-ROW(E$2)+1),ROW(E108))),\"\")","v":""},{"$f":"IFERROR(INDEX(G$3:G$281,SMALL(IF(B$3:B$281=\"In\",ROW(F$2:F$280)-ROW(F$2)+1),ROW(F108))),\"\")","v":""},{"$f":"IFERROR(INDEX(H$3:H$281,SMALL(IF(B$3:B$281=\"In\",ROW(H$2:H$280)-ROW(G$2)+1),ROW(G108))),\"\")","v":""},{"$f":"IFERROR(INDEX(I$3:I$281,SMALL(IF(B$3:B$281=\"In\",ROW(I$2:I$280)-ROW(H$2)+1),ROW(H108))),\"\")","v":""},{"$f":"IFERROR(INDEX(J$3:J$281,SMALL(IF(B$3:B$281=\"In\",ROW(J$2:J$280)-ROW(I$2)+1),ROW(I108))),\"\")","v":""},{"$f":"IFERROR(INDEX(K$3:K$281,SMALL(IF(B$3:B$281=\"In\",ROW(K$2:K$280)-ROW(J$2)+1),ROW(J108))),\"\")","v":""},{"$f":"IFERROR(INDEX(L$3:L$281,SMALL(IF(B$3:B$281=\"In\",ROW(L$2:L$280)-ROW(K$2)+1),ROW(K108))),\"\")","v":""}]
[false,"Out","EWTF","Mindset","N",109,"Engagement with the future","Anticipate and plan for future financial needs including less positive scenarios ","Extent of plans for funding future care needs ","NI Life & Times survey 2010 (careplan/Q15)","Have you thought about or made any plans for how you might fund the care and support you may need as you get older? This might include in-home support or a care home.\nCODES 3,4,5,6 CAN BE MULTICODE\n1. I haven't really thought about it\n2. I've thought about it but haven’t done anything specific\n3. I’m saving money which could pay for this (e.g. savings, pension or investments)\n4. I’ve taken out insurance cover to pay for this (e.g. long-term care plan)\n5. I could sell property to pay for this\n6. I hope my family would help fund this\n7. Other (please specify)\n8. Don't know",null,null,null,null,{"$f":"IFERROR(INDEX(F$3:F$281,SMALL(IF(B$3:B$281=\"In\",ROW(F$2:F$280)-ROW(F$2)+1),ROW(F109))),\"\")","v":""},{"$f":"IFERROR(INDEX(D$3:D$281,SMALL(IF(B$3:B$281=\"In\",ROW(D$2:D$280)-ROW(F$2)+1),ROW(F109))),\"\")","v":""},{"$f":"IFERROR(INDEX(E$3:E$281,SMALL(IF(B$3:B$281=\"In\",ROW(E$2:E$280)-ROW(E$2)+1),ROW(E109))),\"\")","v":""},{"$f":"IFERROR(INDEX(G$3:G$281,SMALL(IF(B$3:B$281=\"In\",ROW(F$2:F$280)-ROW(F$2)+1),ROW(F109))),\"\")","v":""},{"$f":"IFERROR(INDEX(H$3:H$281,SMALL(IF(B$3:B$281=\"In\",ROW(H$2:H$280)-ROW(G$2)+1),ROW(G109))),\"\")","v":""},{"$f":"IFERROR(INDEX(I$3:I$281,SMALL(IF(B$3:B$281=\"In\",ROW(I$2:I$280)-ROW(H$2)+1),ROW(H109))),\"\")","v":""},{"$f":"IFERROR(INDEX(J$3:J$281,SMALL(IF(B$3:B$281=\"In\",ROW(J$2:J$280)-ROW(I$2)+1),ROW(I109))),\"\")","v":""},{"$f":"IFERROR(INDEX(K$3:K$281,SMALL(IF(B$3:B$281=\"In\",ROW(K$2:K$280)-ROW(J$2)+1),ROW(J109))),\"\")","v":""},{"$f":"IFERROR(INDEX(L$3:L$281,SMALL(IF(B$3:B$281=\"In\",ROW(L$2:L$280)-ROW(K$2)+1),ROW(K109))),\"\")","v":""}]
[false,"Out","EWTF","Mindset","N",110,"Engagement with the future","Anticipate and plan for future financial needs including less positive scenarios ","Extent of plans for coping with income loss due to changes in tax or benefits","NI Life & Times survey 2010 (careplan/Q15)","Have you thought about or made any plans for how you might cope financially with an unexpected fall in your or your household’s income because of changes in tax or benefits?\nCODES 3,4,5,6 CAN BE MULTICODE\n1. I haven't really thought about it\n2. I've thought about it but haven’t done anything specific\n3. I’m saving money which could pay for this (e.g. savings, pension or investments)\n4. I could sell property to pay for this\n5. I hope family would help fund this\n6. Other (please specify)\n7. Don't know\n\n",null,null,null,null,{"$f":"IFERROR(INDEX(F$3:F$281,SMALL(IF(B$3:B$281=\"In\",ROW(F$2:F$280)-ROW(F$2)+1),ROW(F110))),\"\")","v":""},{"$f":"IFERROR(INDEX(D$3:D$281,SMALL(IF(B$3:B$281=\"In\",ROW(D$2:D$280)-ROW(F$2)+1),ROW(F110))),\"\")","v":""},{"$f":"IFERROR(INDEX(E$3:E$281,SMALL(IF(B$3:B$281=\"In\",ROW(E$2:E$280)-ROW(E$2)+1),ROW(E110))),\"\")","v":""},{"$f":"IFERROR(INDEX(G$3:G$281,SMALL(IF(B$3:B$281=\"In\",ROW(F$2:F$280)-ROW(F$2)+1),ROW(F110))),\"\")","v":""},{"$f":"IFERROR(INDEX(H$3:H$281,SMALL(IF(B$3:B$281=\"In\",ROW(H$2:H$280)-ROW(G$2)+1),ROW(G110))),\"\")","v":""},{"$f":"IFERROR(INDEX(I$3:I$281,SMALL(IF(B$3:B$281=\"In\",ROW(I$2:I$280)-ROW(H$2)+1),ROW(H110))),\"\")","v":""},{"$f":"IFERROR(INDEX(J$3:J$281,SMALL(IF(B$3:B$281=\"In\",ROW(J$2:J$280)-ROW(I$2)+1),ROW(I110))),\"\")","v":""},{"$f":"IFERROR(INDEX(K$3:K$281,SMALL(IF(B$3:B$281=\"In\",ROW(K$2:K$280)-ROW(J$2)+1),ROW(J110))),\"\")","v":""},{"$f":"IFERROR(INDEX(L$3:L$281,SMALL(IF(B$3:B$281=\"In\",ROW(L$2:L$280)-ROW(K$2)+1),ROW(K110))),\"\")","v":""}]
[false,"Out","EWTF","Mindset","N",111,"Engagement with the future","Anticipate and plan for future financial needs including less positive scenarios ","Extent of plans for coping with income loss due to redundancy or ill health","NI Life & Times survey 2010 (careplan/Q15)","Have you thought about or made any plans for how you might cope financially with an unexpected fall in your or your household’s income because of redundancy or ill-health?\nCODES 3,4,5,6,7 CAN BE MULTICODE\n1. I haven't really thought about it\n2. I've thought about it but haven’t done anything specific\n3. I’m saving money which could pay for this (e.g. savings, pension or investments)\n4. I’ve taken out insurance to pay for this \n5. I could sell property to pay for this\n6. I hope family would help fund this\n7. Other (please specify)\n8. Don't know\n",null,null,null,null,{"$f":"IFERROR(INDEX(F$3:F$281,SMALL(IF(B$3:B$281=\"In\",ROW(F$2:F$280)-ROW(F$2)+1),ROW(F111))),\"\")","v":""},{"$f":"IFERROR(INDEX(D$3:D$281,SMALL(IF(B$3:B$281=\"In\",ROW(D$2:D$280)-ROW(F$2)+1),ROW(F111))),\"\")","v":""},{"$f":"IFERROR(INDEX(E$3:E$281,SMALL(IF(B$3:B$281=\"In\",ROW(E$2:E$280)-ROW(E$2)+1),ROW(E111))),\"\")","v":""},{"$f":"IFERROR(INDEX(G$3:G$281,SMALL(IF(B$3:B$281=\"In\",ROW(F$2:F$280)-ROW(F$2)+1),ROW(F111))),\"\")","v":""},{"$f":"IFERROR(INDEX(H$3:H$281,SMALL(IF(B$3:B$281=\"In\",ROW(H$2:H$280)-ROW(G$2)+1),ROW(G111))),\"\")","v":""},{"$f":"IFERROR(INDEX(I$3:I$281,SMALL(IF(B$3:B$281=\"In\",ROW(I$2:I$280)-ROW(H$2)+1),ROW(H111))),\"\")","v":""},{"$f":"IFERROR(INDEX(J$3:J$281,SMALL(IF(B$3:B$281=\"In\",ROW(J$2:J$280)-ROW(I$2)+1),ROW(I111))),\"\")","v":""},{"$f":"IFERROR(INDEX(K$3:K$281,SMALL(IF(B$3:B$281=\"In\",ROW(K$2:K$280)-ROW(J$2)+1),ROW(J111))),\"\")","v":""},{"$f":"IFERROR(INDEX(L$3:L$281,SMALL(IF(B$3:B$281=\"In\",ROW(L$2:L$280)-ROW(K$2)+1),ROW(K111))),\"\")","v":""}]
[false,"Out","EWTF","Mindset","N",112,"Engagement with the future","Anticipate and plan for future financial needs including less positive scenarios ","Extent of plans for coping with a rise in mortgage repayments","NI Life & Times survey 2010 (careplan/Q15)","ONLY IF HAVE A MORTGAGE: 35. Have you thought about or made any plans for how you might cope financially if interest rates rise and your or your household’s mortgage repayments increase?\nCODES 3,4,5,6,7 CAN BE MULTICODE\n1. I haven't really thought about it\n2. I've thought about it but haven’t done anything specific\n3. I’m saving money which could pay for this (e.g. savings, pension or investments)\n4. I would switch to a new mortgage deal\n5. I could sell property to pay for this\n6. I hope family would help fund this\n7. Other (please specify)\n8. This won’t affect me – I’m on a fixed rate mortgage\n9. Don't know\n",null,null,null,null,{"$f":"IFERROR(INDEX(F$3:F$281,SMALL(IF(B$3:B$281=\"In\",ROW(F$2:F$280)-ROW(F$2)+1),ROW(F112))),\"\")","v":""},{"$f":"IFERROR(INDEX(D$3:D$281,SMALL(IF(B$3:B$281=\"In\",ROW(D$2:D$280)-ROW(F$2)+1),ROW(F112))),\"\")","v":""},{"$f":"IFERROR(INDEX(E$3:E$281,SMALL(IF(B$3:B$281=\"In\",ROW(E$2:E$280)-ROW(E$2)+1),ROW(E112))),\"\")","v":""},{"$f":"IFERROR(INDEX(G$3:G$281,SMALL(IF(B$3:B$281=\"In\",ROW(F$2:F$280)-ROW(F$2)+1),ROW(F112))),\"\")","v":""},{"$f":"IFERROR(INDEX(H$3:H$281,SMALL(IF(B$3:B$281=\"In\",ROW(H$2:H$280)-ROW(G$2)+1),ROW(G112))),\"\")","v":""},{"$f":"IFERROR(INDEX(I$3:I$281,SMALL(IF(B$3:B$281=\"In\",ROW(I$2:I$280)-ROW(H$2)+1),ROW(H112))),\"\")","v":""},{"$f":"IFERROR(INDEX(J$3:J$281,SMALL(IF(B$3:B$281=\"In\",ROW(J$2:J$280)-ROW(I$2)+1),ROW(I112))),\"\")","v":""},{"$f":"IFERROR(INDEX(K$3:K$281,SMALL(IF(B$3:B$281=\"In\",ROW(K$2:K$280)-ROW(J$2)+1),ROW(J112))),\"\")","v":""},{"$f":"IFERROR(INDEX(L$3:L$281,SMALL(IF(B$3:B$281=\"In\",ROW(L$2:L$280)-ROW(K$2)+1),ROW(K112))),\"\")","v":""}]
[false,"Out","FN","Ability","Y",113,"Financial numeracy","Understand financial concepts and are able to answer basic questions around\ninterest rates","Ability to calculate interest earned from savings\n","Fincap N3 & N3B","QUIZ Suppose you put £100 into a savings account with a guaranteed interest rate of 2% per year. You don’t make any further payments into this account and you don’t withdraw any money.\n\nHow much would be in the account at the end of the first year, once the interest payment is made?\n\nAnd how much would be in the account at the end of five years (remembering there are\nno fees or tax deductions). Would it be..?\n1. More than £110\n2. Exactly £110\n3. Less than £110\n4. Or is it impossible to tell from the information given\n5. Don’t know\n",null,null,null,null,{"$f":"IFERROR(INDEX(F$3:F$281,SMALL(IF(B$3:B$281=\"In\",ROW(F$2:F$280)-ROW(F$2)+1),ROW(F113))),\"\")","v":""},{"$f":"IFERROR(INDEX(D$3:D$281,SMALL(IF(B$3:B$281=\"In\",ROW(D$2:D$280)-ROW(F$2)+1),ROW(F113))),\"\")","v":""},{"$f":"IFERROR(INDEX(E$3:E$281,SMALL(IF(B$3:B$281=\"In\",ROW(E$2:E$280)-ROW(E$2)+1),ROW(E113))),\"\")","v":""},{"$f":"IFERROR(INDEX(G$3:G$281,SMALL(IF(B$3:B$281=\"In\",ROW(F$2:F$280)-ROW(F$2)+1),ROW(F113))),\"\")","v":""},{"$f":"IFERROR(INDEX(H$3:H$281,SMALL(IF(B$3:B$281=\"In\",ROW(H$2:H$280)-ROW(G$2)+1),ROW(G113))),\"\")","v":""},{"$f":"IFERROR(INDEX(I$3:I$281,SMALL(IF(B$3:B$281=\"In\",ROW(I$2:I$280)-ROW(H$2)+1),ROW(H113))),\"\")","v":""},{"$f":"IFERROR(INDEX(J$3:J$281,SMALL(IF(B$3:B$281=\"In\",ROW(J$2:J$280)-ROW(I$2)+1),ROW(I113))),\"\")","v":""},{"$f":"IFERROR(INDEX(K$3:K$281,SMALL(IF(B$3:B$281=\"In\",ROW(K$2:K$280)-ROW(J$2)+1),ROW(J113))),\"\")","v":""},{"$f":"IFERROR(INDEX(L$3:L$281,SMALL(IF(B$3:B$281=\"In\",ROW(L$2:L$280)-ROW(K$2)+1),ROW(K113))),\"\")","v":""}]
[false,"Out","FN","Ability","N",114,"Financial numeracy","Understand financial concepts and are able to answer basic questions around\ninterest rates","Ability to calculate interest owed on a loan","PDL (Q97a)","QUIZ You have taken out a loan for £500, and the interest rate you are charged is 10 percent per month. There are no other fees. At this interest rate, how much money would you owe in total after one month?\n\nA £505\nB £550\nC £510\nD £600\n",null,null,null,null,{"$f":"IFERROR(INDEX(F$3:F$281,SMALL(IF(B$3:B$281=\"In\",ROW(F$2:F$280)-ROW(F$2)+1),ROW(F114))),\"\")","v":""},{"$f":"IFERROR(INDEX(D$3:D$281,SMALL(IF(B$3:B$281=\"In\",ROW(D$2:D$280)-ROW(F$2)+1),ROW(F114))),\"\")","v":""},{"$f":"IFERROR(INDEX(E$3:E$281,SMALL(IF(B$3:B$281=\"In\",ROW(E$2:E$280)-ROW(E$2)+1),ROW(E114))),\"\")","v":""},{"$f":"IFERROR(INDEX(G$3:G$281,SMALL(IF(B$3:B$281=\"In\",ROW(F$2:F$280)-ROW(F$2)+1),ROW(F114))),\"\")","v":""},{"$f":"IFERROR(INDEX(H$3:H$281,SMALL(IF(B$3:B$281=\"In\",ROW(H$2:H$280)-ROW(G$2)+1),ROW(G114))),\"\")","v":""},{"$f":"IFERROR(INDEX(I$3:I$281,SMALL(IF(B$3:B$281=\"In\",ROW(I$2:I$280)-ROW(H$2)+1),ROW(H114))),\"\")","v":""},{"$f":"IFERROR(INDEX(J$3:J$281,SMALL(IF(B$3:B$281=\"In\",ROW(J$2:J$280)-ROW(I$2)+1),ROW(I114))),\"\")","v":""},{"$f":"IFERROR(INDEX(K$3:K$281,SMALL(IF(B$3:B$281=\"In\",ROW(K$2:K$280)-ROW(J$2)+1),ROW(J114))),\"\")","v":""},{"$f":"IFERROR(INDEX(L$3:L$281,SMALL(IF(B$3:B$281=\"In\",ROW(L$2:L$280)-ROW(K$2)+1),ROW(K114))),\"\")","v":""}]
[false,"Out","FN","Ability","Y",115,"Financial numeracy","Understand financial concepts and are able to answer basic questions around\ninflation","Understanding of the impact of inflation on buying power","Fincap (N2)","QUIZ If the inflation rate is 5% and the interest rate you get on your savings is 3%, will your savings have more, less or the same amount of buying power in a year’s time?\n1. More\n2. The same\n3. Less\n4. Don’t know",null,null,null,null,{"$f":"IFERROR(INDEX(F$3:F$281,SMALL(IF(B$3:B$281=\"In\",ROW(F$2:F$280)-ROW(F$2)+1),ROW(F115))),\"\")","v":""},{"$f":"IFERROR(INDEX(D$3:D$281,SMALL(IF(B$3:B$281=\"In\",ROW(D$2:D$280)-ROW(F$2)+1),ROW(F115))),\"\")","v":""},{"$f":"IFERROR(INDEX(E$3:E$281,SMALL(IF(B$3:B$281=\"In\",ROW(E$2:E$280)-ROW(E$2)+1),ROW(E115))),\"\")","v":""},{"$f":"IFERROR(INDEX(G$3:G$281,SMALL(IF(B$3:B$281=\"In\",ROW(F$2:F$280)-ROW(F$2)+1),ROW(F115))),\"\")","v":""},{"$f":"IFERROR(INDEX(H$3:H$281,SMALL(IF(B$3:B$281=\"In\",ROW(H$2:H$280)-ROW(G$2)+1),ROW(G115))),\"\")","v":""},{"$f":"IFERROR(INDEX(I$3:I$281,SMALL(IF(B$3:B$281=\"In\",ROW(I$2:I$280)-ROW(H$2)+1),ROW(H115))),\"\")","v":""},{"$f":"IFERROR(INDEX(J$3:J$281,SMALL(IF(B$3:B$281=\"In\",ROW(J$2:J$280)-ROW(I$2)+1),ROW(I115))),\"\")","v":""},{"$f":"IFERROR(INDEX(K$3:K$281,SMALL(IF(B$3:B$281=\"In\",ROW(K$2:K$280)-ROW(J$2)+1),ROW(J115))),\"\")","v":""},{"$f":"IFERROR(INDEX(L$3:L$281,SMALL(IF(B$3:B$281=\"In\",ROW(L$2:L$280)-ROW(K$2)+1),ROW(K115))),\"\")","v":""}]
[false,"Out","UFCAP","Ability","N",116,"Understand financial concepts and products  ","Understand different loan types and interest on borrowing","Understanding of loan types and calculating interest","NEW","STEM Which of these statements best describes how knowledgeable you feel about: \n\n- comparing different loans and credit cards\n- credit unions \n- calculating the total cost of a loan or credit such as Brighthouse or a car on hire purchase (including interest and charges)  \n\n1. I have an excellent knowledge\n2. I have a good knowledge\n3. I have a basic knowledge\n4. I know nothing about this\n5. Not applicable",null,null,null,null,{"$f":"IFERROR(INDEX(F$3:F$281,SMALL(IF(B$3:B$281=\"In\",ROW(F$2:F$280)-ROW(F$2)+1),ROW(F116))),\"\")","v":""},{"$f":"IFERROR(INDEX(D$3:D$281,SMALL(IF(B$3:B$281=\"In\",ROW(D$2:D$280)-ROW(F$2)+1),ROW(F116))),\"\")","v":""},{"$f":"IFERROR(INDEX(E$3:E$281,SMALL(IF(B$3:B$281=\"In\",ROW(E$2:E$280)-ROW(E$2)+1),ROW(E116))),\"\")","v":""},{"$f":"IFERROR(INDEX(G$3:G$281,SMALL(IF(B$3:B$281=\"In\",ROW(F$2:F$280)-ROW(F$2)+1),ROW(F116))),\"\")","v":""},{"$f":"IFERROR(INDEX(H$3:H$281,SMALL(IF(B$3:B$281=\"In\",ROW(H$2:H$280)-ROW(G$2)+1),ROW(G116))),\"\")","v":""},{"$f":"IFERROR(INDEX(I$3:I$281,SMALL(IF(B$3:B$281=\"In\",ROW(I$2:I$280)-ROW(H$2)+1),ROW(H116))),\"\")","v":""},{"$f":"IFERROR(INDEX(J$3:J$281,SMALL(IF(B$3:B$281=\"In\",ROW(J$2:J$280)-ROW(I$2)+1),ROW(I116))),\"\")","v":""},{"$f":"IFERROR(INDEX(K$3:K$281,SMALL(IF(B$3:B$281=\"In\",ROW(K$2:K$280)-ROW(J$2)+1),ROW(J116))),\"\")","v":""},{"$f":"IFERROR(INDEX(L$3:L$281,SMALL(IF(B$3:B$281=\"In\",ROW(L$2:L$280)-ROW(K$2)+1),ROW(K116))),\"\")","v":""}]
[false,"Out","UFCAP","Ability","N",117,"Understand financial concepts and products  ","Understand different loan types and interest on borrowing","Understanding of APR","NEW","QUIZ I would like to know whether you think the following statements are true or false.....\n\n - For a six month loan, it will cost you more to borrow money on a loan with a low APR than a loan with a high APR\n\nTrue\nFalse\nDon't know",null,null,null,null,{"$f":"IFERROR(INDEX(F$3:F$281,SMALL(IF(B$3:B$281=\"In\",ROW(F$2:F$280)-ROW(F$2)+1),ROW(F117))),\"\")","v":""},{"$f":"IFERROR(INDEX(D$3:D$281,SMALL(IF(B$3:B$281=\"In\",ROW(D$2:D$280)-ROW(F$2)+1),ROW(F117))),\"\")","v":""},{"$f":"IFERROR(INDEX(E$3:E$281,SMALL(IF(B$3:B$281=\"In\",ROW(E$2:E$280)-ROW(E$2)+1),ROW(E117))),\"\")","v":""},{"$f":"IFERROR(INDEX(G$3:G$281,SMALL(IF(B$3:B$281=\"In\",ROW(F$2:F$280)-ROW(F$2)+1),ROW(F117))),\"\")","v":""},{"$f":"IFERROR(INDEX(H$3:H$281,SMALL(IF(B$3:B$281=\"In\",ROW(H$2:H$280)-ROW(G$2)+1),ROW(G117))),\"\")","v":""},{"$f":"IFERROR(INDEX(I$3:I$281,SMALL(IF(B$3:B$281=\"In\",ROW(I$2:I$280)-ROW(H$2)+1),ROW(H117))),\"\")","v":""},{"$f":"IFERROR(INDEX(J$3:J$281,SMALL(IF(B$3:B$281=\"In\",ROW(J$2:J$280)-ROW(I$2)+1),ROW(I117))),\"\")","v":""},{"$f":"IFERROR(INDEX(K$3:K$281,SMALL(IF(B$3:B$281=\"In\",ROW(K$2:K$280)-ROW(J$2)+1),ROW(J117))),\"\")","v":""},{"$f":"IFERROR(INDEX(L$3:L$281,SMALL(IF(B$3:B$281=\"In\",ROW(L$2:L$280)-ROW(K$2)+1),ROW(K117))),\"\")","v":""}]
[false,"Out","UFCAP","Ability","N",118,"Understand financial concepts and products ","Understand investments ","Understanding of investments \n\n","OECD (QK7)","QUIZ I would like to know whether you think the following statements are true or false.....\n\n - An investment with a high return is likely to be low risk\n - It is usually possible to reduce the risk of investing in the stock market by buying a wide range of stocks and shares. \n\nTrue\nFalse\nDon't know",null,null,null,null,{"$f":"IFERROR(INDEX(F$3:F$281,SMALL(IF(B$3:B$281=\"In\",ROW(F$2:F$280)-ROW(F$2)+1),ROW(F118))),\"\")","v":""},{"$f":"IFERROR(INDEX(D$3:D$281,SMALL(IF(B$3:B$281=\"In\",ROW(D$2:D$280)-ROW(F$2)+1),ROW(F118))),\"\")","v":""},{"$f":"IFERROR(INDEX(E$3:E$281,SMALL(IF(B$3:B$281=\"In\",ROW(E$2:E$280)-ROW(E$2)+1),ROW(E118))),\"\")","v":""},{"$f":"IFERROR(INDEX(G$3:G$281,SMALL(IF(B$3:B$281=\"In\",ROW(F$2:F$280)-ROW(F$2)+1),ROW(F118))),\"\")","v":""},{"$f":"IFERROR(INDEX(H$3:H$281,SMALL(IF(B$3:B$281=\"In\",ROW(H$2:H$280)-ROW(G$2)+1),ROW(G118))),\"\")","v":""},{"$f":"IFERROR(INDEX(I$3:I$281,SMALL(IF(B$3:B$281=\"In\",ROW(I$2:I$280)-ROW(H$2)+1),ROW(H118))),\"\")","v":""},{"$f":"IFERROR(INDEX(J$3:J$281,SMALL(IF(B$3:B$281=\"In\",ROW(J$2:J$280)-ROW(I$2)+1),ROW(I118))),\"\")","v":""},{"$f":"IFERROR(INDEX(K$3:K$281,SMALL(IF(B$3:B$281=\"In\",ROW(K$2:K$280)-ROW(J$2)+1),ROW(J118))),\"\")","v":""},{"$f":"IFERROR(INDEX(L$3:L$281,SMALL(IF(B$3:B$281=\"In\",ROW(L$2:L$280)-ROW(K$2)+1),ROW(K118))),\"\")","v":""}]
[false,"Out","UFCAP","Ability","N",119,"Understanding financial concepts, products and situations","Understand bank accounts ","Knowledge of bank accounts and ability to check bank balance","NEW","STEM: Which of these statements best describes how knowledgeable you feel about: \n\n- bank accounts\n- checking the balance on your bank account\n\n1. I have an excellent knowledge\n2. I have a good knowledge\n3. I have a basic knowledge\n4. I know nothing about this\n5. Not applicable",null,null,null,null,{"$f":"IFERROR(INDEX(F$3:F$281,SMALL(IF(B$3:B$281=\"In\",ROW(F$2:F$280)-ROW(F$2)+1),ROW(F119))),\"\")","v":""},{"$f":"IFERROR(INDEX(D$3:D$281,SMALL(IF(B$3:B$281=\"In\",ROW(D$2:D$280)-ROW(F$2)+1),ROW(F119))),\"\")","v":""},{"$f":"IFERROR(INDEX(E$3:E$281,SMALL(IF(B$3:B$281=\"In\",ROW(E$2:E$280)-ROW(E$2)+1),ROW(E119))),\"\")","v":""},{"$f":"IFERROR(INDEX(G$3:G$281,SMALL(IF(B$3:B$281=\"In\",ROW(F$2:F$280)-ROW(F$2)+1),ROW(F119))),\"\")","v":""},{"$f":"IFERROR(INDEX(H$3:H$281,SMALL(IF(B$3:B$281=\"In\",ROW(H$2:H$280)-ROW(G$2)+1),ROW(G119))),\"\")","v":""},{"$f":"IFERROR(INDEX(I$3:I$281,SMALL(IF(B$3:B$281=\"In\",ROW(I$2:I$280)-ROW(H$2)+1),ROW(H119))),\"\")","v":""},{"$f":"IFERROR(INDEX(J$3:J$281,SMALL(IF(B$3:B$281=\"In\",ROW(J$2:J$280)-ROW(I$2)+1),ROW(I119))),\"\")","v":""},{"$f":"IFERROR(INDEX(K$3:K$281,SMALL(IF(B$3:B$281=\"In\",ROW(K$2:K$280)-ROW(J$2)+1),ROW(J119))),\"\")","v":""},{"$f":"IFERROR(INDEX(L$3:L$281,SMALL(IF(B$3:B$281=\"In\",ROW(L$2:L$280)-ROW(K$2)+1),ROW(K119))),\"\")","v":""}]
[false,"Out","UFCAP","Ability","N",120,"Understanding financial concepts, products and situations","Understand different insurance products and can assess which options are right for them","Understanding of insurance and ability to compare insurance products\n","NEW","STEM: Which of these statements best describes how knowledgeable you feel about: \n\n- insurance\n- comparing different types of insurance\n\n1. I have an excellent knowledge\n2. I have a good knowledge\n3. I have a basic knowledge\n4. I know nothing about this\n5. Not applicable",null,null,null,null,{"$f":"IFERROR(INDEX(F$3:F$281,SMALL(IF(B$3:B$281=\"In\",ROW(F$2:F$280)-ROW(F$2)+1),ROW(F120))),\"\")","v":""},{"$f":"IFERROR(INDEX(D$3:D$281,SMALL(IF(B$3:B$281=\"In\",ROW(D$2:D$280)-ROW(F$2)+1),ROW(F120))),\"\")","v":""},{"$f":"IFERROR(INDEX(E$3:E$281,SMALL(IF(B$3:B$281=\"In\",ROW(E$2:E$280)-ROW(E$2)+1),ROW(E120))),\"\")","v":""},{"$f":"IFERROR(INDEX(G$3:G$281,SMALL(IF(B$3:B$281=\"In\",ROW(F$2:F$280)-ROW(F$2)+1),ROW(F120))),\"\")","v":""},{"$f":"IFERROR(INDEX(H$3:H$281,SMALL(IF(B$3:B$281=\"In\",ROW(H$2:H$280)-ROW(G$2)+1),ROW(G120))),\"\")","v":""},{"$f":"IFERROR(INDEX(I$3:I$281,SMALL(IF(B$3:B$281=\"In\",ROW(I$2:I$280)-ROW(H$2)+1),ROW(H120))),\"\")","v":""},{"$f":"IFERROR(INDEX(J$3:J$281,SMALL(IF(B$3:B$281=\"In\",ROW(J$2:J$280)-ROW(I$2)+1),ROW(I120))),\"\")","v":""},{"$f":"IFERROR(INDEX(K$3:K$281,SMALL(IF(B$3:B$281=\"In\",ROW(K$2:K$280)-ROW(J$2)+1),ROW(J120))),\"\")","v":""},{"$f":"IFERROR(INDEX(L$3:L$281,SMALL(IF(B$3:B$281=\"In\",ROW(L$2:L$280)-ROW(K$2)+1),ROW(K120))),\"\")","v":""}]
[false,"Out","UFCAP","Ability","N ",121,"Understanding financial concepts, products and situations","Understand different types of savings vehicles, and can assess which options are right for them","Understanding of savings accounts and ability to compare savings products","NEW","STEM: Which of these statements best describes how knowledgeable you feel about: \n- savings accounts \n- credit unions \n- comparing savings products  \n1. I have an excellent knowledge\n2. I have a good knowledge\n3. I have a basic knowledge\n4. I know nothing about this\n5. Not applicable",null,null,null,null,{"$f":"IFERROR(INDEX(F$3:F$281,SMALL(IF(B$3:B$281=\"In\",ROW(F$2:F$280)-ROW(F$2)+1),ROW(F121))),\"\")","v":""},{"$f":"IFERROR(INDEX(D$3:D$281,SMALL(IF(B$3:B$281=\"In\",ROW(D$2:D$280)-ROW(F$2)+1),ROW(F121))),\"\")","v":""},{"$f":"IFERROR(INDEX(E$3:E$281,SMALL(IF(B$3:B$281=\"In\",ROW(E$2:E$280)-ROW(E$2)+1),ROW(E121))),\"\")","v":""},{"$f":"IFERROR(INDEX(G$3:G$281,SMALL(IF(B$3:B$281=\"In\",ROW(F$2:F$280)-ROW(F$2)+1),ROW(F121))),\"\")","v":""},{"$f":"IFERROR(INDEX(H$3:H$281,SMALL(IF(B$3:B$281=\"In\",ROW(H$2:H$280)-ROW(G$2)+1),ROW(G121))),\"\")","v":""},{"$f":"IFERROR(INDEX(I$3:I$281,SMALL(IF(B$3:B$281=\"In\",ROW(I$2:I$280)-ROW(H$2)+1),ROW(H121))),\"\")","v":""},{"$f":"IFERROR(INDEX(J$3:J$281,SMALL(IF(B$3:B$281=\"In\",ROW(J$2:J$280)-ROW(I$2)+1),ROW(I121))),\"\")","v":""},{"$f":"IFERROR(INDEX(K$3:K$281,SMALL(IF(B$3:B$281=\"In\",ROW(K$2:K$280)-ROW(J$2)+1),ROW(J121))),\"\")","v":""},{"$f":"IFERROR(INDEX(L$3:L$281,SMALL(IF(B$3:B$281=\"In\",ROW(L$2:L$280)-ROW(K$2)+1),ROW(K121))),\"\")","v":""}]
[false,"Out","UFCAP","Ability","N",122,"Understanding financial concepts, products and options relevant to their issue, life stage or event","Understand concepts, products and options relavent to their pension","Knowledge of pensions, ability to check and make decisions about pensions\n\n","NEW","STEM: Which of these statements best describes how knowledgeable you feel about: \n- pensions\n- checking how much pension income you will get when you retire\n- making decisions about a pension to give you an income you require in retirement \n1. I have an excellent knowledge\n2. I have a good knowledge\n3. I have a basic knowledge\n4. I know nothing about this\n5. Not applicable",null,null,null,null,{"$f":"IFERROR(INDEX(F$3:F$281,SMALL(IF(B$3:B$281=\"In\",ROW(F$2:F$280)-ROW(F$2)+1),ROW(F122))),\"\")","v":""},{"$f":"IFERROR(INDEX(D$3:D$281,SMALL(IF(B$3:B$281=\"In\",ROW(D$2:D$280)-ROW(F$2)+1),ROW(F122))),\"\")","v":""},{"$f":"IFERROR(INDEX(E$3:E$281,SMALL(IF(B$3:B$281=\"In\",ROW(E$2:E$280)-ROW(E$2)+1),ROW(E122))),\"\")","v":""},{"$f":"IFERROR(INDEX(G$3:G$281,SMALL(IF(B$3:B$281=\"In\",ROW(F$2:F$280)-ROW(F$2)+1),ROW(F122))),\"\")","v":""},{"$f":"IFERROR(INDEX(H$3:H$281,SMALL(IF(B$3:B$281=\"In\",ROW(H$2:H$280)-ROW(G$2)+1),ROW(G122))),\"\")","v":""},{"$f":"IFERROR(INDEX(I$3:I$281,SMALL(IF(B$3:B$281=\"In\",ROW(I$2:I$280)-ROW(H$2)+1),ROW(H122))),\"\")","v":""},{"$f":"IFERROR(INDEX(J$3:J$281,SMALL(IF(B$3:B$281=\"In\",ROW(J$2:J$280)-ROW(I$2)+1),ROW(I122))),\"\")","v":""},{"$f":"IFERROR(INDEX(K$3:K$281,SMALL(IF(B$3:B$281=\"In\",ROW(K$2:K$280)-ROW(J$2)+1),ROW(J122))),\"\")","v":""},{"$f":"IFERROR(INDEX(L$3:L$281,SMALL(IF(B$3:B$281=\"In\",ROW(L$2:L$280)-ROW(K$2)+1),ROW(K122))),\"\")","v":""}]
[false,"Out","UFCAP","Ability","N ",123,"Understanding financial concepts, products and options relevant to their issue, life stage or event","Understand concepts, products and options relevant to their mortgage","Understanding of mortgages and mortgage repayments ","NEW","STEM: Which of these statements best describes how knowledgeable you feel about:  \n- mortgages\n- applying for a mortgage\n- calculating you monthly mortgage repayments if interest rates rise\n1. I have an excellent knowledge\n2. I have a good knowledge\n3. I have a basic knowledge\n4. I know nothing about this\n5. Not applicable",null,null,null,null,{"$f":"IFERROR(INDEX(F$3:F$281,SMALL(IF(B$3:B$281=\"In\",ROW(F$2:F$280)-ROW(F$2)+1),ROW(F123))),\"\")","v":""},{"$f":"IFERROR(INDEX(D$3:D$281,SMALL(IF(B$3:B$281=\"In\",ROW(D$2:D$280)-ROW(F$2)+1),ROW(F123))),\"\")","v":""},{"$f":"IFERROR(INDEX(E$3:E$281,SMALL(IF(B$3:B$281=\"In\",ROW(E$2:E$280)-ROW(E$2)+1),ROW(E123))),\"\")","v":""},{"$f":"IFERROR(INDEX(G$3:G$281,SMALL(IF(B$3:B$281=\"In\",ROW(F$2:F$280)-ROW(F$2)+1),ROW(F123))),\"\")","v":""},{"$f":"IFERROR(INDEX(H$3:H$281,SMALL(IF(B$3:B$281=\"In\",ROW(H$2:H$280)-ROW(G$2)+1),ROW(G123))),\"\")","v":""},{"$f":"IFERROR(INDEX(I$3:I$281,SMALL(IF(B$3:B$281=\"In\",ROW(I$2:I$280)-ROW(H$2)+1),ROW(H123))),\"\")","v":""},{"$f":"IFERROR(INDEX(J$3:J$281,SMALL(IF(B$3:B$281=\"In\",ROW(J$2:J$280)-ROW(I$2)+1),ROW(I123))),\"\")","v":""},{"$f":"IFERROR(INDEX(K$3:K$281,SMALL(IF(B$3:B$281=\"In\",ROW(K$2:K$280)-ROW(J$2)+1),ROW(J123))),\"\")","v":""},{"$f":"IFERROR(INDEX(L$3:L$281,SMALL(IF(B$3:B$281=\"In\",ROW(L$2:L$280)-ROW(K$2)+1),ROW(K123))),\"\")","v":""}]
[false,"Out","UFCAP","Ability","N",124,"Understanding financial concepts, products and options relevant to their issue, life stage or event","Understand concepts, products and options relevant to problem debt","Knowledge of options and rights in relation to problem debt","DAE (Q25)","STEM: Which of these statements best describes how knowledgeable you feel about:  \n- the different options for sorting out debt problems\n- the fees charged for debt solutions such as bankruptcy, Debt Relief Orders and Debt Management Plans\n- the steps I should take if I’m unable to pay my debts \n- my rights when companies try to recover money I owe them\n- the steps companies can take to recover the money I owe them\n1. I have an excellent knowledge\n2. I have a good knowledge\n3. I have a basic knowledge\n4. I know nothing about this\n5. Not applicable\n\n\n",null,null,null,null,{"$f":"IFERROR(INDEX(F$3:F$281,SMALL(IF(B$3:B$281=\"In\",ROW(F$2:F$280)-ROW(F$2)+1),ROW(F124))),\"\")","v":""},{"$f":"IFERROR(INDEX(D$3:D$281,SMALL(IF(B$3:B$281=\"In\",ROW(D$2:D$280)-ROW(F$2)+1),ROW(F124))),\"\")","v":""},{"$f":"IFERROR(INDEX(E$3:E$281,SMALL(IF(B$3:B$281=\"In\",ROW(E$2:E$280)-ROW(E$2)+1),ROW(E124))),\"\")","v":""},{"$f":"IFERROR(INDEX(G$3:G$281,SMALL(IF(B$3:B$281=\"In\",ROW(F$2:F$280)-ROW(F$2)+1),ROW(F124))),\"\")","v":""},{"$f":"IFERROR(INDEX(H$3:H$281,SMALL(IF(B$3:B$281=\"In\",ROW(H$2:H$280)-ROW(G$2)+1),ROW(G124))),\"\")","v":""},{"$f":"IFERROR(INDEX(I$3:I$281,SMALL(IF(B$3:B$281=\"In\",ROW(I$2:I$280)-ROW(H$2)+1),ROW(H124))),\"\")","v":""},{"$f":"IFERROR(INDEX(J$3:J$281,SMALL(IF(B$3:B$281=\"In\",ROW(J$2:J$280)-ROW(I$2)+1),ROW(I124))),\"\")","v":""},{"$f":"IFERROR(INDEX(K$3:K$281,SMALL(IF(B$3:B$281=\"In\",ROW(K$2:K$280)-ROW(J$2)+1),ROW(J124))),\"\")","v":""},{"$f":"IFERROR(INDEX(L$3:L$281,SMALL(IF(B$3:B$281=\"In\",ROW(L$2:L$280)-ROW(K$2)+1),ROW(K124))),\"\")","v":""}]
[false,"Out","KWAAG","Ability","N",125,"Knowledge of where to go for advice, guidance and tools about their financial situation, in person, by phone and using digital resources"," ","Awareness of different advice providers ","Fincap (F2)","Which, if any, of these providers of advice on your money you have ever heard of, even if you’re not very familiar with them?\n\nSELECT ALL THAT APPLY\n\n1. Money Advice Service\n2.Citizen’s Advice Bureau\n3.Money Sense\n4.Which?\n5.Money Saving Expert (Martin Lewis)\n6.Other price comparison sites (e.g. Moneysupermarket, Comparethemarket)\n7.Directgov (gov.co.uk)\n8. Consumer Credit Counselling Service (CCCS)/StepChange\n9. National Debtline\n[ADD OTHER RELEVANT ORGANISATIONS/SITES]\n11. None of these\n",null,null,null,null,{"$f":"IFERROR(INDEX(F$3:F$281,SMALL(IF(B$3:B$281=\"In\",ROW(F$2:F$280)-ROW(F$2)+1),ROW(F125))),\"\")","v":""},{"$f":"IFERROR(INDEX(D$3:D$281,SMALL(IF(B$3:B$281=\"In\",ROW(D$2:D$280)-ROW(F$2)+1),ROW(F125))),\"\")","v":""},{"$f":"IFERROR(INDEX(E$3:E$281,SMALL(IF(B$3:B$281=\"In\",ROW(E$2:E$280)-ROW(E$2)+1),ROW(E125))),\"\")","v":""},{"$f":"IFERROR(INDEX(G$3:G$281,SMALL(IF(B$3:B$281=\"In\",ROW(F$2:F$280)-ROW(F$2)+1),ROW(F125))),\"\")","v":""},{"$f":"IFERROR(INDEX(H$3:H$281,SMALL(IF(B$3:B$281=\"In\",ROW(H$2:H$280)-ROW(G$2)+1),ROW(G125))),\"\")","v":""},{"$f":"IFERROR(INDEX(I$3:I$281,SMALL(IF(B$3:B$281=\"In\",ROW(I$2:I$280)-ROW(H$2)+1),ROW(H125))),\"\")","v":""},{"$f":"IFERROR(INDEX(J$3:J$281,SMALL(IF(B$3:B$281=\"In\",ROW(J$2:J$280)-ROW(I$2)+1),ROW(I125))),\"\")","v":""},{"$f":"IFERROR(INDEX(K$3:K$281,SMALL(IF(B$3:B$281=\"In\",ROW(K$2:K$280)-ROW(J$2)+1),ROW(J125))),\"\")","v":""},{"$f":"IFERROR(INDEX(L$3:L$281,SMALL(IF(B$3:B$281=\"In\",ROW(L$2:L$280)-ROW(K$2)+1),ROW(K125))),\"\")","v":""}]
[false,"Out","KWAAG","Ability","N",126,"Knowledge of where to go for advice, guidance and tools about their financial situation, in person, by phone and using digital resources"," ","Knowledge of how to access money advice","NEW","STEM: Which of these statements best describes how knowledgeable you feel about:  \n- where to get  advice if you need help with your finances\n\n1. I have an excellent knowledge\n2. I have a good knowledge\n3. I have a basic knowledge\n4. I know nothing about this\n5. Not applicable",null,null,null,null,{"$f":"IFERROR(INDEX(F$3:F$281,SMALL(IF(B$3:B$281=\"In\",ROW(F$2:F$280)-ROW(F$2)+1),ROW(F126))),\"\")","v":""},{"$f":"IFERROR(INDEX(D$3:D$281,SMALL(IF(B$3:B$281=\"In\",ROW(D$2:D$280)-ROW(F$2)+1),ROW(F126))),\"\")","v":""},{"$f":"IFERROR(INDEX(E$3:E$281,SMALL(IF(B$3:B$281=\"In\",ROW(E$2:E$280)-ROW(E$2)+1),ROW(E126))),\"\")","v":""},{"$f":"IFERROR(INDEX(G$3:G$281,SMALL(IF(B$3:B$281=\"In\",ROW(F$2:F$280)-ROW(F$2)+1),ROW(F126))),\"\")","v":""},{"$f":"IFERROR(INDEX(H$3:H$281,SMALL(IF(B$3:B$281=\"In\",ROW(H$2:H$280)-ROW(G$2)+1),ROW(G126))),\"\")","v":""},{"$f":"IFERROR(INDEX(I$3:I$281,SMALL(IF(B$3:B$281=\"In\",ROW(I$2:I$280)-ROW(H$2)+1),ROW(H126))),\"\")","v":""},{"$f":"IFERROR(INDEX(J$3:J$281,SMALL(IF(B$3:B$281=\"In\",ROW(J$2:J$280)-ROW(I$2)+1),ROW(I126))),\"\")","v":""},{"$f":"IFERROR(INDEX(K$3:K$281,SMALL(IF(B$3:B$281=\"In\",ROW(K$2:K$280)-ROW(J$2)+1),ROW(J126))),\"\")","v":""},{"$f":"IFERROR(INDEX(L$3:L$281,SMALL(IF(B$3:B$281=\"In\",ROW(L$2:L$280)-ROW(K$2)+1),ROW(K126))),\"\")","v":""}]
[false,"Out","UFCAP","Ability","N ",127,"Understanding financial concepts, products and situations","Understand the main types of financial fraud and how to protect themselves from it","Knowledge about types of fraud and ability to protect from fraud ","NEW","STEM: Which of these statements best describes how knowledgeable you feel about:  \n- different types of financial fraud/scams \n- protecting yourself from financial fraud / scams\n- protecting yourself from online financial fraud / scams\n\n1. I have an excellent knowledge\n2. I have a good knowledge\n3. I have a basic knowledge\n4. I know nothing about this\n5. Not applicable\n",null,null,null,null,{"$f":"IFERROR(INDEX(F$3:F$281,SMALL(IF(B$3:B$281=\"In\",ROW(F$2:F$280)-ROW(F$2)+1),ROW(F127))),\"\")","v":""},{"$f":"IFERROR(INDEX(D$3:D$281,SMALL(IF(B$3:B$281=\"In\",ROW(D$2:D$280)-ROW(F$2)+1),ROW(F127))),\"\")","v":""},{"$f":"IFERROR(INDEX(E$3:E$281,SMALL(IF(B$3:B$281=\"In\",ROW(E$2:E$280)-ROW(E$2)+1),ROW(E127))),\"\")","v":""},{"$f":"IFERROR(INDEX(G$3:G$281,SMALL(IF(B$3:B$281=\"In\",ROW(F$2:F$280)-ROW(F$2)+1),ROW(F127))),\"\")","v":""},{"$f":"IFERROR(INDEX(H$3:H$281,SMALL(IF(B$3:B$281=\"In\",ROW(H$2:H$280)-ROW(G$2)+1),ROW(G127))),\"\")","v":""},{"$f":"IFERROR(INDEX(I$3:I$281,SMALL(IF(B$3:B$281=\"In\",ROW(I$2:I$280)-ROW(H$2)+1),ROW(H127))),\"\")","v":""},{"$f":"IFERROR(INDEX(J$3:J$281,SMALL(IF(B$3:B$281=\"In\",ROW(J$2:J$280)-ROW(I$2)+1),ROW(I127))),\"\")","v":""},{"$f":"IFERROR(INDEX(K$3:K$281,SMALL(IF(B$3:B$281=\"In\",ROW(K$2:K$280)-ROW(J$2)+1),ROW(J127))),\"\")","v":""},{"$f":"IFERROR(INDEX(L$3:L$281,SMALL(IF(B$3:B$281=\"In\",ROW(L$2:L$280)-ROW(K$2)+1),ROW(K127))),\"\")","v":""}]
[false,"Out","UFCAP","Ability","N ",128,"Understanding money management","Understand the principles of budgeting and can develop a budget suited to their needs","Ability to create a weekly or monthly budget ","NEW","STEM: Which of these statements best describes how knowledgeable you feel about: \n- creating a weekly or monthly household budget\n\n1. I have an excellent knowledge\n2. I have a good knowledge\n3. I have a basic knowledge\n4. I know nothing about this\n5. Not applicable\n",null,null,null,null,{"$f":"IFERROR(INDEX(F$3:F$281,SMALL(IF(B$3:B$281=\"In\",ROW(F$2:F$280)-ROW(F$2)+1),ROW(F128))),\"\")","v":""},{"$f":"IFERROR(INDEX(D$3:D$281,SMALL(IF(B$3:B$281=\"In\",ROW(D$2:D$280)-ROW(F$2)+1),ROW(F128))),\"\")","v":""},{"$f":"IFERROR(INDEX(E$3:E$281,SMALL(IF(B$3:B$281=\"In\",ROW(E$2:E$280)-ROW(E$2)+1),ROW(E128))),\"\")","v":""},{"$f":"IFERROR(INDEX(G$3:G$281,SMALL(IF(B$3:B$281=\"In\",ROW(F$2:F$280)-ROW(F$2)+1),ROW(F128))),\"\")","v":""},{"$f":"IFERROR(INDEX(H$3:H$281,SMALL(IF(B$3:B$281=\"In\",ROW(H$2:H$280)-ROW(G$2)+1),ROW(G128))),\"\")","v":""},{"$f":"IFERROR(INDEX(I$3:I$281,SMALL(IF(B$3:B$281=\"In\",ROW(I$2:I$280)-ROW(H$2)+1),ROW(H128))),\"\")","v":""},{"$f":"IFERROR(INDEX(J$3:J$281,SMALL(IF(B$3:B$281=\"In\",ROW(J$2:J$280)-ROW(I$2)+1),ROW(I128))),\"\")","v":""},{"$f":"IFERROR(INDEX(K$3:K$281,SMALL(IF(B$3:B$281=\"In\",ROW(K$2:K$280)-ROW(J$2)+1),ROW(J128))),\"\")","v":""},{"$f":"IFERROR(INDEX(L$3:L$281,SMALL(IF(B$3:B$281=\"In\",ROW(L$2:L$280)-ROW(K$2)+1),ROW(K128))),\"\")","v":""}]
[false,"Out","UFCAP","Ability","N",129,"Understanding money management","Knowing how to make their money go further","Ability to use a price comparison site ","NEW","STEM: Which of these statements best describes how knowledgeable you feel about: \n - using a price comparison website \n\n1. I have an excellent knowledge\n2. I have a good knowledge\n3. I have a basic knowledge\n4. I know nothing about this\n5. Not applicable\n\n",null,null,null,null,{"$f":"IFERROR(INDEX(F$3:F$281,SMALL(IF(B$3:B$281=\"In\",ROW(F$2:F$280)-ROW(F$2)+1),ROW(F129))),\"\")","v":""},{"$f":"IFERROR(INDEX(D$3:D$281,SMALL(IF(B$3:B$281=\"In\",ROW(D$2:D$280)-ROW(F$2)+1),ROW(F129))),\"\")","v":""},{"$f":"IFERROR(INDEX(E$3:E$281,SMALL(IF(B$3:B$281=\"In\",ROW(E$2:E$280)-ROW(E$2)+1),ROW(E129))),\"\")","v":""},{"$f":"IFERROR(INDEX(G$3:G$281,SMALL(IF(B$3:B$281=\"In\",ROW(F$2:F$280)-ROW(F$2)+1),ROW(F129))),\"\")","v":""},{"$f":"IFERROR(INDEX(H$3:H$281,SMALL(IF(B$3:B$281=\"In\",ROW(H$2:H$280)-ROW(G$2)+1),ROW(G129))),\"\")","v":""},{"$f":"IFERROR(INDEX(I$3:I$281,SMALL(IF(B$3:B$281=\"In\",ROW(I$2:I$280)-ROW(H$2)+1),ROW(H129))),\"\")","v":""},{"$f":"IFERROR(INDEX(J$3:J$281,SMALL(IF(B$3:B$281=\"In\",ROW(J$2:J$280)-ROW(I$2)+1),ROW(I129))),\"\")","v":""},{"$f":"IFERROR(INDEX(K$3:K$281,SMALL(IF(B$3:B$281=\"In\",ROW(K$2:K$280)-ROW(J$2)+1),ROW(J129))),\"\")","v":""},{"$f":"IFERROR(INDEX(L$3:L$281,SMALL(IF(B$3:B$281=\"In\",ROW(L$2:L$280)-ROW(K$2)+1),ROW(K129))),\"\")","v":""}]
[false,"Out","UFCAP","Ability","N",130,"Understanding money management","Knowing how to make their money go further","Ability to check benefits entitlements and tax payments","NEW","STEM: Which of these statements best describes how knowledgeable you feel about: \n- checking you’re getting all benefits you are entitled to\n- checking you’re paying the correct amount of tax\n\n1. I have an excellent knowledge\n2. I have a good knowledge\n3. I have a basic knowledge\n4. I know nothing about this\n5. Not applicable\n\n",null,null,null,null,{"$f":"IFERROR(INDEX(F$3:F$281,SMALL(IF(B$3:B$281=\"In\",ROW(F$2:F$280)-ROW(F$2)+1),ROW(F130))),\"\")","v":""},{"$f":"IFERROR(INDEX(D$3:D$281,SMALL(IF(B$3:B$281=\"In\",ROW(D$2:D$280)-ROW(F$2)+1),ROW(F130))),\"\")","v":""},{"$f":"IFERROR(INDEX(E$3:E$281,SMALL(IF(B$3:B$281=\"In\",ROW(E$2:E$280)-ROW(E$2)+1),ROW(E130))),\"\")","v":""},{"$f":"IFERROR(INDEX(G$3:G$281,SMALL(IF(B$3:B$281=\"In\",ROW(F$2:F$280)-ROW(F$2)+1),ROW(F130))),\"\")","v":""},{"$f":"IFERROR(INDEX(H$3:H$281,SMALL(IF(B$3:B$281=\"In\",ROW(H$2:H$280)-ROW(G$2)+1),ROW(G130))),\"\")","v":""},{"$f":"IFERROR(INDEX(I$3:I$281,SMALL(IF(B$3:B$281=\"In\",ROW(I$2:I$280)-ROW(H$2)+1),ROW(H130))),\"\")","v":""},{"$f":"IFERROR(INDEX(J$3:J$281,SMALL(IF(B$3:B$281=\"In\",ROW(J$2:J$280)-ROW(I$2)+1),ROW(I130))),\"\")","v":""},{"$f":"IFERROR(INDEX(K$3:K$281,SMALL(IF(B$3:B$281=\"In\",ROW(K$2:K$280)-ROW(J$2)+1),ROW(J130))),\"\")","v":""},{"$f":"IFERROR(INDEX(L$3:L$281,SMALL(IF(B$3:B$281=\"In\",ROW(L$2:L$280)-ROW(K$2)+1),ROW(K130))),\"\")","v":""}]
[false,"Out","BS","Ability","N",131,"Basic skills: Literacy","People have the level of literacy needed to fill in forms and read information about financial products in English (or Welsh in Wales)","Level of literacy ","SKILL (bqwrite)","How good are you at each of the following:\n\na)  writing in English when you need to in daily life? For example: writing letters or notes or filling in official forms?\nb) reading in English when you need to? For example\nreading newspapers and magazines or reading letters, paperwork or forms?\n\n1. Very good \n2. Fairly good \n3. Below average \n4. Poor \n5. No opinion. \n6, Don't Know  ",null,null,null,null,{"$f":"IFERROR(INDEX(F$3:F$281,SMALL(IF(B$3:B$281=\"In\",ROW(F$2:F$280)-ROW(F$2)+1),ROW(F131))),\"\")","v":""},{"$f":"IFERROR(INDEX(D$3:D$281,SMALL(IF(B$3:B$281=\"In\",ROW(D$2:D$280)-ROW(F$2)+1),ROW(F131))),\"\")","v":""},{"$f":"IFERROR(INDEX(E$3:E$281,SMALL(IF(B$3:B$281=\"In\",ROW(E$2:E$280)-ROW(E$2)+1),ROW(E131))),\"\")","v":""},{"$f":"IFERROR(INDEX(G$3:G$281,SMALL(IF(B$3:B$281=\"In\",ROW(F$2:F$280)-ROW(F$2)+1),ROW(F131))),\"\")","v":""},{"$f":"IFERROR(INDEX(H$3:H$281,SMALL(IF(B$3:B$281=\"In\",ROW(H$2:H$280)-ROW(G$2)+1),ROW(G131))),\"\")","v":""},{"$f":"IFERROR(INDEX(I$3:I$281,SMALL(IF(B$3:B$281=\"In\",ROW(I$2:I$280)-ROW(H$2)+1),ROW(H131))),\"\")","v":""},{"$f":"IFERROR(INDEX(J$3:J$281,SMALL(IF(B$3:B$281=\"In\",ROW(J$2:J$280)-ROW(I$2)+1),ROW(I131))),\"\")","v":""},{"$f":"IFERROR(INDEX(K$3:K$281,SMALL(IF(B$3:B$281=\"In\",ROW(K$2:K$280)-ROW(J$2)+1),ROW(J131))),\"\")","v":""},{"$f":"IFERROR(INDEX(L$3:L$281,SMALL(IF(B$3:B$281=\"In\",ROW(L$2:L$280)-ROW(K$2)+1),ROW(K131))),\"\")","v":""}]
[false,"Out","BS","Ability","N",132,"Basic skills: Digital Literacy","Able to use financial/money-related online services eg. forms, tools, emails, and online banking\n","Ability to carry out financial tasks and transactions online ","DSK (2.3)","A) Do you access to the internet at home or elsewhere?\nYes\nNo\nDon't know\n\nIF DO HAVE ACCESS\nB) STEM I’d like you to think about different commercial transactions people do in their everyday lives like banking or shopping. How how knowledgeable you feel about: \na) Buying a product online\nb) Making travel reservations/bookings\nc) Paying bills\nd) Using your bank’s online services\ne) Comparing products and services\nf) Ordering groceries or food online\ng) Selling things online\nh) Finding the location of a house,  office, store or restaurant \n\n1. I have an excellent knowledge\n2. I have a good knowledge\n3. I have a basic knowledge\n4. I know nothing about this\n5. Not applicable",null,null,null,null,{"$f":"IFERROR(INDEX(F$3:F$281,SMALL(IF(B$3:B$281=\"In\",ROW(F$2:F$280)-ROW(F$2)+1),ROW(F132))),\"\")","v":""},{"$f":"IFERROR(INDEX(D$3:D$281,SMALL(IF(B$3:B$281=\"In\",ROW(D$2:D$280)-ROW(F$2)+1),ROW(F132))),\"\")","v":""},{"$f":"IFERROR(INDEX(E$3:E$281,SMALL(IF(B$3:B$281=\"In\",ROW(E$2:E$280)-ROW(E$2)+1),ROW(E132))),\"\")","v":""},{"$f":"IFERROR(INDEX(G$3:G$281,SMALL(IF(B$3:B$281=\"In\",ROW(F$2:F$280)-ROW(F$2)+1),ROW(F132))),\"\")","v":""},{"$f":"IFERROR(INDEX(H$3:H$281,SMALL(IF(B$3:B$281=\"In\",ROW(H$2:H$280)-ROW(G$2)+1),ROW(G132))),\"\")","v":""},{"$f":"IFERROR(INDEX(I$3:I$281,SMALL(IF(B$3:B$281=\"In\",ROW(I$2:I$280)-ROW(H$2)+1),ROW(H132))),\"\")","v":""},{"$f":"IFERROR(INDEX(J$3:J$281,SMALL(IF(B$3:B$281=\"In\",ROW(J$2:J$280)-ROW(I$2)+1),ROW(I132))),\"\")","v":""},{"$f":"IFERROR(INDEX(K$3:K$281,SMALL(IF(B$3:B$281=\"In\",ROW(K$2:K$280)-ROW(J$2)+1),ROW(J132))),\"\")","v":""},{"$f":"IFERROR(INDEX(L$3:L$281,SMALL(IF(B$3:B$281=\"In\",ROW(L$2:L$280)-ROW(K$2)+1),ROW(K132))),\"\")","v":""}]
[false,"Out","BS","Ability","N",133,"Basic skills: Digital Literacy","Able to navigate online content and locate the information they need","Ability to use the internet","DSK (1.1.3a)","How would you rate your ability to use the\nInternet?\n1. Excellent\n2. Good\n3. Fair\n4. Poor\n5. Bad\n6. Don’t know",null,null,null,null,{"$f":"IFERROR(INDEX(F$3:F$281,SMALL(IF(B$3:B$281=\"In\",ROW(F$2:F$280)-ROW(F$2)+1),ROW(F133))),\"\")","v":""},{"$f":"IFERROR(INDEX(D$3:D$281,SMALL(IF(B$3:B$281=\"In\",ROW(D$2:D$280)-ROW(F$2)+1),ROW(F133))),\"\")","v":""},{"$f":"IFERROR(INDEX(E$3:E$281,SMALL(IF(B$3:B$281=\"In\",ROW(E$2:E$280)-ROW(E$2)+1),ROW(E133))),\"\")","v":""},{"$f":"IFERROR(INDEX(G$3:G$281,SMALL(IF(B$3:B$281=\"In\",ROW(F$2:F$280)-ROW(F$2)+1),ROW(F133))),\"\")","v":""},{"$f":"IFERROR(INDEX(H$3:H$281,SMALL(IF(B$3:B$281=\"In\",ROW(H$2:H$280)-ROW(G$2)+1),ROW(G133))),\"\")","v":""},{"$f":"IFERROR(INDEX(I$3:I$281,SMALL(IF(B$3:B$281=\"In\",ROW(I$2:I$280)-ROW(H$2)+1),ROW(H133))),\"\")","v":""},{"$f":"IFERROR(INDEX(J$3:J$281,SMALL(IF(B$3:B$281=\"In\",ROW(J$2:J$280)-ROW(I$2)+1),ROW(I133))),\"\")","v":""},{"$f":"IFERROR(INDEX(K$3:K$281,SMALL(IF(B$3:B$281=\"In\",ROW(K$2:K$280)-ROW(J$2)+1),ROW(J133))),\"\")","v":""},{"$f":"IFERROR(INDEX(L$3:L$281,SMALL(IF(B$3:B$281=\"In\",ROW(L$2:L$280)-ROW(K$2)+1),ROW(K133))),\"\")","v":""}]
[false,"Out","BS","Ability","N",134,"Basic skills:Digital literacy","Able to navigate online content and locate the information they need","Ability to find information online\n\n","SEG (P5)","To what extent do you agree or disagree with the following statements?\n\n- When I need information the first place I look is the internet\n - I find it easy to find what I am looking for online\n - I would rather look at information in a paper leaflet than on a company’s website\n\n1. Strongly Agree\n2. Tend to Agree\n3. Tend to disagree\n4. Strongly  disagree\n5. Don’t know\n6. Does not apply to me\n ",null,null,null,null,{"$f":"IFERROR(INDEX(F$3:F$281,SMALL(IF(B$3:B$281=\"In\",ROW(F$2:F$280)-ROW(F$2)+1),ROW(F134))),\"\")","v":""},{"$f":"IFERROR(INDEX(D$3:D$281,SMALL(IF(B$3:B$281=\"In\",ROW(D$2:D$280)-ROW(F$2)+1),ROW(F134))),\"\")","v":""},{"$f":"IFERROR(INDEX(E$3:E$281,SMALL(IF(B$3:B$281=\"In\",ROW(E$2:E$280)-ROW(E$2)+1),ROW(E134))),\"\")","v":""},{"$f":"IFERROR(INDEX(G$3:G$281,SMALL(IF(B$3:B$281=\"In\",ROW(F$2:F$280)-ROW(F$2)+1),ROW(F134))),\"\")","v":""},{"$f":"IFERROR(INDEX(H$3:H$281,SMALL(IF(B$3:B$281=\"In\",ROW(H$2:H$280)-ROW(G$2)+1),ROW(G134))),\"\")","v":""},{"$f":"IFERROR(INDEX(I$3:I$281,SMALL(IF(B$3:B$281=\"In\",ROW(I$2:I$280)-ROW(H$2)+1),ROW(H134))),\"\")","v":""},{"$f":"IFERROR(INDEX(J$3:J$281,SMALL(IF(B$3:B$281=\"In\",ROW(J$2:J$280)-ROW(I$2)+1),ROW(I134))),\"\")","v":""},{"$f":"IFERROR(INDEX(K$3:K$281,SMALL(IF(B$3:B$281=\"In\",ROW(K$2:K$280)-ROW(J$2)+1),ROW(J134))),\"\")","v":""},{"$f":"IFERROR(INDEX(L$3:L$281,SMALL(IF(B$3:B$281=\"In\",ROW(L$2:L$280)-ROW(K$2)+1),ROW(K134))),\"\")","v":""}]
[false,"Out","BS","Ability","N",135,"Basic skills: Communication","Able to confidently interact with others in English (or Welsh in Wales)","Ease of communicating in English or (Welsh in Wales)  ","NEW","Can I check, is English your first language?  Yes/No\n\n[IF NO]  So can I check would you have any difficulty speaking in English to a member of staff in a bank about choosing a financial product?\n1. Yes\n2. No\n\nIF IN WALES: \nCan I check, is English or Welsh your first language?  \nYes - English\nYes - Welsh\nNo, neither\n\n[IF NEITHER]  So can I check would you have any difficulty speaking in English or Welsh to a member of staff in a bank about choosing a financial product?\n1. Yes\n2. No",null,null,null,null,{"$f":"IFERROR(INDEX(F$3:F$281,SMALL(IF(B$3:B$281=\"In\",ROW(F$2:F$280)-ROW(F$2)+1),ROW(F135))),\"\")","v":""},{"$f":"IFERROR(INDEX(D$3:D$281,SMALL(IF(B$3:B$281=\"In\",ROW(D$2:D$280)-ROW(F$2)+1),ROW(F135))),\"\")","v":""},{"$f":"IFERROR(INDEX(E$3:E$281,SMALL(IF(B$3:B$281=\"In\",ROW(E$2:E$280)-ROW(E$2)+1),ROW(E135))),\"\")","v":""},{"$f":"IFERROR(INDEX(G$3:G$281,SMALL(IF(B$3:B$281=\"In\",ROW(F$2:F$280)-ROW(F$2)+1),ROW(F135))),\"\")","v":""},{"$f":"IFERROR(INDEX(H$3:H$281,SMALL(IF(B$3:B$281=\"In\",ROW(H$2:H$280)-ROW(G$2)+1),ROW(G135))),\"\")","v":""},{"$f":"IFERROR(INDEX(I$3:I$281,SMALL(IF(B$3:B$281=\"In\",ROW(I$2:I$280)-ROW(H$2)+1),ROW(H135))),\"\")","v":""},{"$f":"IFERROR(INDEX(J$3:J$281,SMALL(IF(B$3:B$281=\"In\",ROW(J$2:J$280)-ROW(I$2)+1),ROW(I135))),\"\")","v":""},{"$f":"IFERROR(INDEX(K$3:K$281,SMALL(IF(B$3:B$281=\"In\",ROW(K$2:K$280)-ROW(J$2)+1),ROW(J135))),\"\")","v":""},{"$f":"IFERROR(INDEX(L$3:L$281,SMALL(IF(B$3:B$281=\"In\",ROW(L$2:L$280)-ROW(K$2)+1),ROW(K135))),\"\")","v":""}]
[false,"Out","MEANS","Means","N",136,"Income","Employment status","N/A","Standard question","Thinking about your employment, what is your current status?\n\nSELECT ONE ONLY\nIF MORE THAN ONE APPLIES, SELECT MAIN STATUS\nIF ON MATERNITY LEAVE FROM EMPLOYER AND PLANNING ON RETURNING COUNT THIS AS WORKING\n1. Working for an employer full-time (that is for 30 or more hours per week)\n2. Working for an employer part-time (that is for less than 30 hours per week)\n3. Self-employed (with or without workers)\n4. Unemployed and looking for work\n5. Unemployed and not looking for work\n6. Retired\n7. Student\n8. Permanently sick / disabled\n9. Temporarily sick \n10. Looking after home\n11. Other \n",null,null,null,null,{"$f":"IFERROR(INDEX(F$3:F$281,SMALL(IF(B$3:B$281=\"In\",ROW(F$2:F$280)-ROW(F$2)+1),ROW(F136))),\"\")","v":""},{"$f":"IFERROR(INDEX(D$3:D$281,SMALL(IF(B$3:B$281=\"In\",ROW(D$2:D$280)-ROW(F$2)+1),ROW(F136))),\"\")","v":""},{"$f":"IFERROR(INDEX(E$3:E$281,SMALL(IF(B$3:B$281=\"In\",ROW(E$2:E$280)-ROW(E$2)+1),ROW(E136))),\"\")","v":""},{"$f":"IFERROR(INDEX(G$3:G$281,SMALL(IF(B$3:B$281=\"In\",ROW(F$2:F$280)-ROW(F$2)+1),ROW(F136))),\"\")","v":""},{"$f":"IFERROR(INDEX(H$3:H$281,SMALL(IF(B$3:B$281=\"In\",ROW(H$2:H$280)-ROW(G$2)+1),ROW(G136))),\"\")","v":""},{"$f":"IFERROR(INDEX(I$3:I$281,SMALL(IF(B$3:B$281=\"In\",ROW(I$2:I$280)-ROW(H$2)+1),ROW(H136))),\"\")","v":""},{"$f":"IFERROR(INDEX(J$3:J$281,SMALL(IF(B$3:B$281=\"In\",ROW(J$2:J$280)-ROW(I$2)+1),ROW(I136))),\"\")","v":""},{"$f":"IFERROR(INDEX(K$3:K$281,SMALL(IF(B$3:B$281=\"In\",ROW(K$2:K$280)-ROW(J$2)+1),ROW(J136))),\"\")","v":""},{"$f":"IFERROR(INDEX(L$3:L$281,SMALL(IF(B$3:B$281=\"In\",ROW(L$2:L$280)-ROW(K$2)+1),ROW(K136))),\"\")","v":""}]
[false,"Out","MEANS","Means","N",137,"Income","Income ","N/A","Fincap P4","A) Which of the following sources of income, if any, do you currently have? Please include any income you receive personally or jointly with your partner or spouse. \nCHOOSE ALL THAT APPLY  \n1. Income from employment/self-employment (including sick pay)\n2. Income from personal or occupational pensions\n3. Income from savings/investments\n4. Rent you receive from boarders or lodgers (not family members) or other property you rent out or sublet\n5. Child maintenance payments\n6. Other types of payments or maintenance from parents or other family members who you do not live with, including as regular gifts\n7. None of these (SINGLE CODE ONLY)\n8. Don’t know  (SINGLE CODE ONLY)\n9. Prefer not to say  (SINGLE CODE ONLY)\n\nB) And which of the following sources of income do you currently have, if any?\nCHOOSE ALL THAT APPLY  \n1. State Pension\n2. Pension Credit\n3. Child benefit\n4. Universal Credit\n5. Working Tax Credits\n6. Job Seekers Allowance (JSA) \n7. Employment and Support Allowance (ESA)\n8. Income Support \n9. Housing benefit\n10. Council Tax Reduction\n11. Disability Living Allowance (DLA), Personal Independence Payment (PIP) or Attendance Allowance (AA)\n12. Carers Allowance\n13. Something else \n14. None of these (SINGLE CODE ONLY)\n15. Don't know (SINGLE CODE ONLY)\n16. Prefer not to say (SINGLE CODE ONLY)",null,null,null,null,{"$f":"IFERROR(INDEX(F$3:F$281,SMALL(IF(B$3:B$281=\"In\",ROW(F$2:F$280)-ROW(F$2)+1),ROW(F137))),\"\")","v":""},{"$f":"IFERROR(INDEX(D$3:D$281,SMALL(IF(B$3:B$281=\"In\",ROW(D$2:D$280)-ROW(F$2)+1),ROW(F137))),\"\")","v":""},{"$f":"IFERROR(INDEX(E$3:E$281,SMALL(IF(B$3:B$281=\"In\",ROW(E$2:E$280)-ROW(E$2)+1),ROW(E137))),\"\")","v":""},{"$f":"IFERROR(INDEX(G$3:G$281,SMALL(IF(B$3:B$281=\"In\",ROW(F$2:F$280)-ROW(F$2)+1),ROW(F137))),\"\")","v":""},{"$f":"IFERROR(INDEX(H$3:H$281,SMALL(IF(B$3:B$281=\"In\",ROW(H$2:H$280)-ROW(G$2)+1),ROW(G137))),\"\")","v":""},{"$f":"IFERROR(INDEX(I$3:I$281,SMALL(IF(B$3:B$281=\"In\",ROW(I$2:I$280)-ROW(H$2)+1),ROW(H137))),\"\")","v":""},{"$f":"IFERROR(INDEX(J$3:J$281,SMALL(IF(B$3:B$281=\"In\",ROW(J$2:J$280)-ROW(I$2)+1),ROW(I137))),\"\")","v":""},{"$f":"IFERROR(INDEX(K$3:K$281,SMALL(IF(B$3:B$281=\"In\",ROW(K$2:K$280)-ROW(J$2)+1),ROW(J137))),\"\")","v":""},{"$f":"IFERROR(INDEX(L$3:L$281,SMALL(IF(B$3:B$281=\"In\",ROW(L$2:L$280)-ROW(K$2)+1),ROW(K137))),\"\")","v":""}]
[false,"Out","MEANS","Means","N",138,"Income","Income ","N/A","Fincap P1","Which band from the grid below does your household’s total gross income from all sources fall into?\n[INCOME is any money from work, including a second job or occasional work, and any other sources, such as benefits, pensions, savings and investments, maintenance payments and rent from property or subletting.]\nGROSS means the amount you receive before any deductions, income tax, National Insurance etc. \nCHOOSE ONE ONLY\n Per Week Per Month Per Year\n1. Up to £86 Up to £374 Under £4,500\n2. £87 - £124 £375 - £541 £4,500 - £6,499\n3.  £125 - £143 £542 - £624 £6,500 - £7,499\n4.  £144 - £182 £625 - £791 £7,500 - £9,499\n5. £183 - £220 £792 - £957 £9,500 - £11,499\n6. £221 - £259 £958 - £1,124 £11,500 - £13,499\n7.  £260 - £297 £1,125 - £1,291 £13,500 - £15,499\n8.  £298 - £336 £1,292 - £1,457 £15,500 - £17,499\n9.  £337 - £384 £1,458 - £1,666 £17,500 - £19,999\n10.  £385 - £480 £1,667 - £2,082 £20,000 - £24,999\n11. £481 - £576 £2,083 - £2,499 £25,000 - £29,999\n12. £577 - £672 £2,500 - £2,916 £30,000 - £34,999\n13. £673 - £768 £2,917 - £3,332 £35,000 - £39,999\n14. £769 - £961 £3,333 - £4,166 £40,000 - £49,999\n15 £962 - £1,441 £4,167 - £6,249 £50,000 - £74,999\n16.  £1,442 - £1,922 £6,250 - £8,332 £75,000 - £99,999\n17. £1,923+ £8,333+ £100,000+\n18. Don’t know\n19. Prefer not to say ",null,null,null,null,{"$f":"IFERROR(INDEX(F$3:F$281,SMALL(IF(B$3:B$281=\"In\",ROW(F$2:F$280)-ROW(F$2)+1),ROW(F138))),\"\")","v":""},{"$f":"IFERROR(INDEX(D$3:D$281,SMALL(IF(B$3:B$281=\"In\",ROW(D$2:D$280)-ROW(F$2)+1),ROW(F138))),\"\")","v":""},{"$f":"IFERROR(INDEX(E$3:E$281,SMALL(IF(B$3:B$281=\"In\",ROW(E$2:E$280)-ROW(E$2)+1),ROW(E138))),\"\")","v":""},{"$f":"IFERROR(INDEX(G$3:G$281,SMALL(IF(B$3:B$281=\"In\",ROW(F$2:F$280)-ROW(F$2)+1),ROW(F138))),\"\")","v":""},{"$f":"IFERROR(INDEX(H$3:H$281,SMALL(IF(B$3:B$281=\"In\",ROW(H$2:H$280)-ROW(G$2)+1),ROW(G138))),\"\")","v":""},{"$f":"IFERROR(INDEX(I$3:I$281,SMALL(IF(B$3:B$281=\"In\",ROW(I$2:I$280)-ROW(H$2)+1),ROW(H138))),\"\")","v":""},{"$f":"IFERROR(INDEX(J$3:J$281,SMALL(IF(B$3:B$281=\"In\",ROW(J$2:J$280)-ROW(I$2)+1),ROW(I138))),\"\")","v":""},{"$f":"IFERROR(INDEX(K$3:K$281,SMALL(IF(B$3:B$281=\"In\",ROW(K$2:K$280)-ROW(J$2)+1),ROW(J138))),\"\")","v":""},{"$f":"IFERROR(INDEX(L$3:L$281,SMALL(IF(B$3:B$281=\"In\",ROW(L$2:L$280)-ROW(K$2)+1),ROW(K138))),\"\")","v":""}]
[false,"Out","MEANS","Means","N",139,"Income","Income ","N/A","NEW","POST\nBy how much has your income increased since [REFERENCE POINT]?\n1. ENTER AMOUNT IN £\n2. Stayed the same\n3. Has fallen\n4. Don't know\n5. Prefer not to say",null,null,null,null,{"$f":"IFERROR(INDEX(F$3:F$281,SMALL(IF(B$3:B$281=\"In\",ROW(F$2:F$280)-ROW(F$2)+1),ROW(F139))),\"\")","v":""},{"$f":"IFERROR(INDEX(D$3:D$281,SMALL(IF(B$3:B$281=\"In\",ROW(D$2:D$280)-ROW(F$2)+1),ROW(F139))),\"\")","v":""},{"$f":"IFERROR(INDEX(E$3:E$281,SMALL(IF(B$3:B$281=\"In\",ROW(E$2:E$280)-ROW(E$2)+1),ROW(E139))),\"\")","v":""},{"$f":"IFERROR(INDEX(G$3:G$281,SMALL(IF(B$3:B$281=\"In\",ROW(F$2:F$280)-ROW(F$2)+1),ROW(F139))),\"\")","v":""},{"$f":"IFERROR(INDEX(H$3:H$281,SMALL(IF(B$3:B$281=\"In\",ROW(H$2:H$280)-ROW(G$2)+1),ROW(G139))),\"\")","v":""},{"$f":"IFERROR(INDEX(I$3:I$281,SMALL(IF(B$3:B$281=\"In\",ROW(I$2:I$280)-ROW(H$2)+1),ROW(H139))),\"\")","v":""},{"$f":"IFERROR(INDEX(J$3:J$281,SMALL(IF(B$3:B$281=\"In\",ROW(J$2:J$280)-ROW(I$2)+1),ROW(I139))),\"\")","v":""},{"$f":"IFERROR(INDEX(K$3:K$281,SMALL(IF(B$3:B$281=\"In\",ROW(K$2:K$280)-ROW(J$2)+1),ROW(J139))),\"\")","v":""},{"$f":"IFERROR(INDEX(L$3:L$281,SMALL(IF(B$3:B$281=\"In\",ROW(L$2:L$280)-ROW(K$2)+1),ROW(K139))),\"\")","v":""}]
[false,"Out","MEANS","Means","N",140,"Income","Income ","N/A","Fincap P3","Which one of these best applies to you personally?\n1. Pay income tax at a basic rate\n2. Pay income tax at a higher rate\n3. Do not pay income tax\n4. Don’t know\n5. Prefer not to say",null,null,null,null,{"$f":"IFERROR(INDEX(F$3:F$281,SMALL(IF(B$3:B$281=\"In\",ROW(F$2:F$280)-ROW(F$2)+1),ROW(F140))),\"\")","v":""},{"$f":"IFERROR(INDEX(D$3:D$281,SMALL(IF(B$3:B$281=\"In\",ROW(D$2:D$280)-ROW(F$2)+1),ROW(F140))),\"\")","v":""},{"$f":"IFERROR(INDEX(E$3:E$281,SMALL(IF(B$3:B$281=\"In\",ROW(E$2:E$280)-ROW(E$2)+1),ROW(E140))),\"\")","v":""},{"$f":"IFERROR(INDEX(G$3:G$281,SMALL(IF(B$3:B$281=\"In\",ROW(F$2:F$280)-ROW(F$2)+1),ROW(F140))),\"\")","v":""},{"$f":"IFERROR(INDEX(H$3:H$281,SMALL(IF(B$3:B$281=\"In\",ROW(H$2:H$280)-ROW(G$2)+1),ROW(G140))),\"\")","v":""},{"$f":"IFERROR(INDEX(I$3:I$281,SMALL(IF(B$3:B$281=\"In\",ROW(I$2:I$280)-ROW(H$2)+1),ROW(H140))),\"\")","v":""},{"$f":"IFERROR(INDEX(J$3:J$281,SMALL(IF(B$3:B$281=\"In\",ROW(J$2:J$280)-ROW(I$2)+1),ROW(I140))),\"\")","v":""},{"$f":"IFERROR(INDEX(K$3:K$281,SMALL(IF(B$3:B$281=\"In\",ROW(K$2:K$280)-ROW(J$2)+1),ROW(J140))),\"\")","v":""},{"$f":"IFERROR(INDEX(L$3:L$281,SMALL(IF(B$3:B$281=\"In\",ROW(L$2:L$280)-ROW(K$2)+1),ROW(K140))),\"\")","v":""}]
[false,"Out","MEANS","Means","N",141,"Savings","Savings","N/A","PDL Qsav","Please can you tell me whether you currently have money saved in any of the following types of savings accounts and investments, including any joint accounts? CHOOSE ALL THAT APPLY\n1. A savings or deposit account with a bank or building society\n2. An account with a Credit Union\n3. Cash ISA\n4. Premium bonds\n5. Stocks and shares\n6. Other savings products\n7. Other investment product (not including pension)\n8. None of these (SINGLE CODE ONLY)\n9. Don't know (SINGLE CODE ONLY)\n10. Prefer not to say (SINGLE CODE ONLY)",null,null,null,null,{"$f":"IFERROR(INDEX(F$3:F$281,SMALL(IF(B$3:B$281=\"In\",ROW(F$2:F$280)-ROW(F$2)+1),ROW(F141))),\"\")","v":""},{"$f":"IFERROR(INDEX(D$3:D$281,SMALL(IF(B$3:B$281=\"In\",ROW(D$2:D$280)-ROW(F$2)+1),ROW(F141))),\"\")","v":""},{"$f":"IFERROR(INDEX(E$3:E$281,SMALL(IF(B$3:B$281=\"In\",ROW(E$2:E$280)-ROW(E$2)+1),ROW(E141))),\"\")","v":""},{"$f":"IFERROR(INDEX(G$3:G$281,SMALL(IF(B$3:B$281=\"In\",ROW(F$2:F$280)-ROW(F$2)+1),ROW(F141))),\"\")","v":""},{"$f":"IFERROR(INDEX(H$3:H$281,SMALL(IF(B$3:B$281=\"In\",ROW(H$2:H$280)-ROW(G$2)+1),ROW(G141))),\"\")","v":""},{"$f":"IFERROR(INDEX(I$3:I$281,SMALL(IF(B$3:B$281=\"In\",ROW(I$2:I$280)-ROW(H$2)+1),ROW(H141))),\"\")","v":""},{"$f":"IFERROR(INDEX(J$3:J$281,SMALL(IF(B$3:B$281=\"In\",ROW(J$2:J$280)-ROW(I$2)+1),ROW(I141))),\"\")","v":""},{"$f":"IFERROR(INDEX(K$3:K$281,SMALL(IF(B$3:B$281=\"In\",ROW(K$2:K$280)-ROW(J$2)+1),ROW(J141))),\"\")","v":""},{"$f":"IFERROR(INDEX(L$3:L$281,SMALL(IF(B$3:B$281=\"In\",ROW(L$2:L$280)-ROW(K$2)+1),ROW(K141))),\"\")","v":""}]
[false,"Out","MEANS","Means","N",142,"Other assets","Other assets ","N/A","ELSA IAPROP and SEG N6","A) Which, if any, of these assets do you have, not including your own home? Please include any in your sole name or jointly owned with someone else\nCHOOSE ALL THAT APPLY. \n1. Houses, flats or holiday homes, including timeshares (not including this home) \n2. Farm or Business Property (such as a shop, warehouse or garage) \n3. Other land \n4. Cars, motorbikes, boats and other motor vehicles\n5. Money owed to you by others \n6. Money held in a trust \n7. Art, antiques, collectables, jewellery, and other valuables\n8. Other assets\n9. None of these (SINGLE CODE ONLY)\n10. Don't know (SINGLE CODE ONLY)\n11. Prefer not to say (SINGLE CODE ONLY)\n\nB) How much, in total, do you think they are currently worth? We only need your best estimate if you are unsure. \nCHOOSE ONE ONLY\n1. Less than £30,000 \n2. £30,000 to £39,999\n3. £40,000 to £49,999\n4. £50,000 to £74,999\n5. £75,000 to £99,999\n6. £100,000 to £149,999\n7. £150,000 to £199,999\n8. £200,000 to £249,999\n9. £250,000 to £500,000\n10. £500,000+\n11. Don't know (SINGLE CODE ONLY)\n12. Prefer not to say (SINGLE CODE ONLY)",null,null,null,null,{"$f":"IFERROR(INDEX(F$3:F$281,SMALL(IF(B$3:B$281=\"In\",ROW(F$2:F$280)-ROW(F$2)+1),ROW(F142))),\"\")","v":""},{"$f":"IFERROR(INDEX(D$3:D$281,SMALL(IF(B$3:B$281=\"In\",ROW(D$2:D$280)-ROW(F$2)+1),ROW(F142))),\"\")","v":""},{"$f":"IFERROR(INDEX(E$3:E$281,SMALL(IF(B$3:B$281=\"In\",ROW(E$2:E$280)-ROW(E$2)+1),ROW(E142))),\"\")","v":""},{"$f":"IFERROR(INDEX(G$3:G$281,SMALL(IF(B$3:B$281=\"In\",ROW(F$2:F$280)-ROW(F$2)+1),ROW(F142))),\"\")","v":""},{"$f":"IFERROR(INDEX(H$3:H$281,SMALL(IF(B$3:B$281=\"In\",ROW(H$2:H$280)-ROW(G$2)+1),ROW(G142))),\"\")","v":""},{"$f":"IFERROR(INDEX(I$3:I$281,SMALL(IF(B$3:B$281=\"In\",ROW(I$2:I$280)-ROW(H$2)+1),ROW(H142))),\"\")","v":""},{"$f":"IFERROR(INDEX(J$3:J$281,SMALL(IF(B$3:B$281=\"In\",ROW(J$2:J$280)-ROW(I$2)+1),ROW(I142))),\"\")","v":""},{"$f":"IFERROR(INDEX(K$3:K$281,SMALL(IF(B$3:B$281=\"In\",ROW(K$2:K$280)-ROW(J$2)+1),ROW(J142))),\"\")","v":""},{"$f":"IFERROR(INDEX(L$3:L$281,SMALL(IF(B$3:B$281=\"In\",ROW(L$2:L$280)-ROW(K$2)+1),ROW(K142))),\"\")","v":""}]
[false,"Out","MEANS","Means","N",143,"Other assets","Other assets ","N/A","WAS Ten1\nSEG F21\nWAS Hvalue","A) In which of these ways do you (and your household) occupy your home?\n1. Own it outright\n2. Buying it with the help of a mortgage or loan\n3. Pay part rent and part mortgage (shared ownership)\n4. Rent it\n5. Live here rent-free (including rent-free in relative's/friend's property; excluding\nsquatting)\n6. Squatting\n\nB) And how much in total is left to pay on your mortgage (or mortgages, if you have more than one). If you are unsure, please give your best estimate.\nCHOOSE ONE ONLY\n1. Less than £10,000\n2. £10,000 to £19,999\n3. £20,000 to £29,999\n4. £30,000 to £39,999\n5. £40,000 to £49,999\n6. £50,000 to £74,999\n7. £75,000 to £99,999\n8. £100,000\n9. to £149,999\n10. £150,000 to £199,999\n11. £200,000 to £249,999\n12. £250,000 to £299,999\n13. £300,000 to £399,999\n14. £400,000 to £499,999\n15. £500,000 or more\n16. Don't know\n17. Prefer not to say\n\nC) About how much would you expect to get (in total and not just your share) for your current home if you sold it today (before paying off any outstanding mortgage or loan on the property)?\nCHOOSE ONE ONLY\nENTER AMOUNT IN £s  If DK, then asked banded question: \n1. Less than £60,000\n2. £60,000 to £99,999\n3. £100,000 to £149.999\n4. £150,000 to £199,999\n5. £200,000 to £249,999\n6. £250,000 to £299,999\n7. £300,000 to £349,999\n8. £350,000 to £399,999\n9. £400,000 to £499,999\n10. £500,000 to £749,999\n11. £750,000 to £999,999\n12. £1 million or more ",null,null,null,null,{"$f":"IFERROR(INDEX(F$3:F$281,SMALL(IF(B$3:B$281=\"In\",ROW(F$2:F$280)-ROW(F$2)+1),ROW(F143))),\"\")","v":""},{"$f":"IFERROR(INDEX(D$3:D$281,SMALL(IF(B$3:B$281=\"In\",ROW(D$2:D$280)-ROW(F$2)+1),ROW(F143))),\"\")","v":""},{"$f":"IFERROR(INDEX(E$3:E$281,SMALL(IF(B$3:B$281=\"In\",ROW(E$2:E$280)-ROW(E$2)+1),ROW(E143))),\"\")","v":""},{"$f":"IFERROR(INDEX(G$3:G$281,SMALL(IF(B$3:B$281=\"In\",ROW(F$2:F$280)-ROW(F$2)+1),ROW(F143))),\"\")","v":""},{"$f":"IFERROR(INDEX(H$3:H$281,SMALL(IF(B$3:B$281=\"In\",ROW(H$2:H$280)-ROW(G$2)+1),ROW(G143))),\"\")","v":""},{"$f":"IFERROR(INDEX(I$3:I$281,SMALL(IF(B$3:B$281=\"In\",ROW(I$2:I$280)-ROW(H$2)+1),ROW(H143))),\"\")","v":""},{"$f":"IFERROR(INDEX(J$3:J$281,SMALL(IF(B$3:B$281=\"In\",ROW(J$2:J$280)-ROW(I$2)+1),ROW(I143))),\"\")","v":""},{"$f":"IFERROR(INDEX(K$3:K$281,SMALL(IF(B$3:B$281=\"In\",ROW(K$2:K$280)-ROW(J$2)+1),ROW(J143))),\"\")","v":""},{"$f":"IFERROR(INDEX(L$3:L$281,SMALL(IF(B$3:B$281=\"In\",ROW(L$2:L$280)-ROW(K$2)+1),ROW(K143))),\"\")","v":""}]
[false,"Out","MEANS","Means","N",144,"Access to affordable credit ","Access to affordable credit ","N/A","HCC 8.9","Please can you tell me which of the following you have had in the last [3 months], whether in your own name or jointly with someone else? Please include any that you are in arrears with.\n1. Credit or store card\n2. Overdraft \n3. Payday loan\n3. Loan from company that collects payments from your home (e.g. Provident, Greenwoods)\n5. Loan from a pawnbroker\n7. Loan from a Credit Union or other community finance organisation\n8. A loan from a friend or relative.\n9. Loan from the Social Fund\n10. Loan from an unlicensed lender who charges interest, sometimes called a loan shark\n11. Any other type of loan from a bank, building society or finance company e.g. Norton Finance, Blackhorse car finance\n11) Something else\n12) Don't know\n13) Prefer not to say",null,null,null,null,{"$f":"IFERROR(INDEX(F$3:F$281,SMALL(IF(B$3:B$281=\"In\",ROW(F$2:F$280)-ROW(F$2)+1),ROW(F144))),\"\")","v":""},{"$f":"IFERROR(INDEX(D$3:D$281,SMALL(IF(B$3:B$281=\"In\",ROW(D$2:D$280)-ROW(F$2)+1),ROW(F144))),\"\")","v":""},{"$f":"IFERROR(INDEX(E$3:E$281,SMALL(IF(B$3:B$281=\"In\",ROW(E$2:E$280)-ROW(E$2)+1),ROW(E144))),\"\")","v":""},{"$f":"IFERROR(INDEX(G$3:G$281,SMALL(IF(B$3:B$281=\"In\",ROW(F$2:F$280)-ROW(F$2)+1),ROW(F144))),\"\")","v":""},{"$f":"IFERROR(INDEX(H$3:H$281,SMALL(IF(B$3:B$281=\"In\",ROW(H$2:H$280)-ROW(G$2)+1),ROW(G144))),\"\")","v":""},{"$f":"IFERROR(INDEX(I$3:I$281,SMALL(IF(B$3:B$281=\"In\",ROW(I$2:I$280)-ROW(H$2)+1),ROW(H144))),\"\")","v":""},{"$f":"IFERROR(INDEX(J$3:J$281,SMALL(IF(B$3:B$281=\"In\",ROW(J$2:J$280)-ROW(I$2)+1),ROW(I144))),\"\")","v":""},{"$f":"IFERROR(INDEX(K$3:K$281,SMALL(IF(B$3:B$281=\"In\",ROW(K$2:K$280)-ROW(J$2)+1),ROW(J144))),\"\")","v":""},{"$f":"IFERROR(INDEX(L$3:L$281,SMALL(IF(B$3:B$281=\"In\",ROW(L$2:L$280)-ROW(K$2)+1),ROW(K144))),\"\")","v":""}]
[false,"Out","PRESSURE","Pressures","N",145,"Committed expenditure","Additional outgoings","Number of additional high-value monthly outgoings","Fincap K2","Do you (and your partner if you have one) regularly spend more than £200 a month on any of the following items? \nCHOOSE ALL THAT APPLY \n1. Travel to work\n2. Rent paid because you work away from home and cannot claim it back\n3. Child care\n4. School fees\n5. Care for someone else (including nursing home)\n6. Financial support to a partner, child or other family member who does not live with you\n7. None of these (SINGLE CODE ONLY)\n8. Don’t know (SINGLE CODE ONLY)\n9. Prefer not to say (SINGLE CODE ONLY)",null,null,null,null,{"$f":"IFERROR(INDEX(F$3:F$281,SMALL(IF(B$3:B$281=\"In\",ROW(F$2:F$280)-ROW(F$2)+1),ROW(F145))),\"\")","v":""},{"$f":"IFERROR(INDEX(D$3:D$281,SMALL(IF(B$3:B$281=\"In\",ROW(D$2:D$280)-ROW(F$2)+1),ROW(F145))),\"\")","v":""},{"$f":"IFERROR(INDEX(E$3:E$281,SMALL(IF(B$3:B$281=\"In\",ROW(E$2:E$280)-ROW(E$2)+1),ROW(E145))),\"\")","v":""},{"$f":"IFERROR(INDEX(G$3:G$281,SMALL(IF(B$3:B$281=\"In\",ROW(F$2:F$280)-ROW(F$2)+1),ROW(F145))),\"\")","v":""},{"$f":"IFERROR(INDEX(H$3:H$281,SMALL(IF(B$3:B$281=\"In\",ROW(H$2:H$280)-ROW(G$2)+1),ROW(G145))),\"\")","v":""},{"$f":"IFERROR(INDEX(I$3:I$281,SMALL(IF(B$3:B$281=\"In\",ROW(I$2:I$280)-ROW(H$2)+1),ROW(H145))),\"\")","v":""},{"$f":"IFERROR(INDEX(J$3:J$281,SMALL(IF(B$3:B$281=\"In\",ROW(J$2:J$280)-ROW(I$2)+1),ROW(I145))),\"\")","v":""},{"$f":"IFERROR(INDEX(K$3:K$281,SMALL(IF(B$3:B$281=\"In\",ROW(K$2:K$280)-ROW(J$2)+1),ROW(J145))),\"\")","v":""},{"$f":"IFERROR(INDEX(L$3:L$281,SMALL(IF(B$3:B$281=\"In\",ROW(L$2:L$280)-ROW(K$2)+1),ROW(K145))),\"\")","v":""}]
[false,"Out","PRESSURE","Pressures","N",146,"Committed expenditure","Additional outgoings","Number of additional high-value monthly outgoings that are more than budget allows for","Fincap K2","Do you (and your partner if you have one) regularly spend more than you can afford on any of the following items? \nPLEASE SELECT ALL THAT APPLY \n1. Travel to work\n2. Rent paid because you work away from home and cannot claim it back\n3. Child care\n4. School fees\n5. Care for someone else (including nursing home)\n6. Financial support to a partner, child or other family member who does not live with you\n7. Paying off credit or store cards \n8. Paying for goods bought on hire purchase or mail order\n8. None of these (SINGLE CODE ONLY)",null,null,null,null,{"$f":"IFERROR(INDEX(F$3:F$281,SMALL(IF(B$3:B$281=\"In\",ROW(F$2:F$280)-ROW(F$2)+1),ROW(F146))),\"\")","v":""},{"$f":"IFERROR(INDEX(D$3:D$281,SMALL(IF(B$3:B$281=\"In\",ROW(D$2:D$280)-ROW(F$2)+1),ROW(F146))),\"\")","v":""},{"$f":"IFERROR(INDEX(E$3:E$281,SMALL(IF(B$3:B$281=\"In\",ROW(E$2:E$280)-ROW(E$2)+1),ROW(E146))),\"\")","v":""},{"$f":"IFERROR(INDEX(G$3:G$281,SMALL(IF(B$3:B$281=\"In\",ROW(F$2:F$280)-ROW(F$2)+1),ROW(F146))),\"\")","v":""},{"$f":"IFERROR(INDEX(H$3:H$281,SMALL(IF(B$3:B$281=\"In\",ROW(H$2:H$280)-ROW(G$2)+1),ROW(G146))),\"\")","v":""},{"$f":"IFERROR(INDEX(I$3:I$281,SMALL(IF(B$3:B$281=\"In\",ROW(I$2:I$280)-ROW(H$2)+1),ROW(H146))),\"\")","v":""},{"$f":"IFERROR(INDEX(J$3:J$281,SMALL(IF(B$3:B$281=\"In\",ROW(J$2:J$280)-ROW(I$2)+1),ROW(I146))),\"\")","v":""},{"$f":"IFERROR(INDEX(K$3:K$281,SMALL(IF(B$3:B$281=\"In\",ROW(K$2:K$280)-ROW(J$2)+1),ROW(J146))),\"\")","v":""},{"$f":"IFERROR(INDEX(L$3:L$281,SMALL(IF(B$3:B$281=\"In\",ROW(L$2:L$280)-ROW(K$2)+1),ROW(K146))),\"\")","v":""}]
[false,"Out","PRESSURE","Pressures","N",147,"Committed expenditure","Dependent children","Number of dependent children","WB C12b","How many children depend on you financially?",null,null,null,null,{"$f":"IFERROR(INDEX(F$3:F$281,SMALL(IF(B$3:B$281=\"In\",ROW(F$2:F$280)-ROW(F$2)+1),ROW(F147))),\"\")","v":""},{"$f":"IFERROR(INDEX(D$3:D$281,SMALL(IF(B$3:B$281=\"In\",ROW(D$2:D$280)-ROW(F$2)+1),ROW(F147))),\"\")","v":""},{"$f":"IFERROR(INDEX(E$3:E$281,SMALL(IF(B$3:B$281=\"In\",ROW(E$2:E$280)-ROW(E$2)+1),ROW(E147))),\"\")","v":""},{"$f":"IFERROR(INDEX(G$3:G$281,SMALL(IF(B$3:B$281=\"In\",ROW(F$2:F$280)-ROW(F$2)+1),ROW(F147))),\"\")","v":""},{"$f":"IFERROR(INDEX(H$3:H$281,SMALL(IF(B$3:B$281=\"In\",ROW(H$2:H$280)-ROW(G$2)+1),ROW(G147))),\"\")","v":""},{"$f":"IFERROR(INDEX(I$3:I$281,SMALL(IF(B$3:B$281=\"In\",ROW(I$2:I$280)-ROW(H$2)+1),ROW(H147))),\"\")","v":""},{"$f":"IFERROR(INDEX(J$3:J$281,SMALL(IF(B$3:B$281=\"In\",ROW(J$2:J$280)-ROW(I$2)+1),ROW(I147))),\"\")","v":""},{"$f":"IFERROR(INDEX(K$3:K$281,SMALL(IF(B$3:B$281=\"In\",ROW(K$2:K$280)-ROW(J$2)+1),ROW(J147))),\"\")","v":""},{"$f":"IFERROR(INDEX(L$3:L$281,SMALL(IF(B$3:B$281=\"In\",ROW(L$2:L$280)-ROW(K$2)+1),ROW(K147))),\"\")","v":""}]
[]
[]
[]
[]
[]
[]
[]
[]
[]
[]
[]
[]
[]
[]
[]
[]
[]
[]
[]
[]
[]
[]
[]
[]
[]
[]
[]
[]
[]
[]
[]
[]
[]
[]
[]
[]
[]
[]
[]
[]
[]
[]
[]
[]
[]
[]
[]
[]
[]
[]
[]
[]
[]
[]
[]
[]
[]
[]
[]
[]
[]
[]
[]
[]
[]
[]
[]
[]
[]
[]
[]
[]
[]
[]
[]
[]
[]
[]
[]
[]
[]
[]
[]
[]
[]
[]
[]
[]
[]
[]
[]
[]
[]
[]
[]
[]
[]
[]
[]
[]
[]
[]
[]
[]
[]
[]
[]
[]
[]
[]
[]
[]
[]
[]
[]
[]
[]
[]
[]
[]
[]
[]
[]
[]
[]
[]
[]
[]
[]
[]
[]
[]
[]
[]
[]
[]
[]
[]
[]
[]
[]
[]
[]
[]
[]
[]
[]
[]
[]
[]
[]
[]
[]
[]
[]
[]
[]
[]
[]
[]
[]
[]
[]
[]
[]
[]
[]
[]
[]
[]
[]
[]
[]
[]
[]
[]
[]
[]
[]
[]
[]
[]
[]
[]
[]
[]
[]
[]
[]
[]
[]
[]
[]
[]
[]
[]
[]
[]
[]
[]
[]
[]
[]
[]
[]
[]
[]
[]
[]
[]
[]
[]
[]
[]
[]
[]
[]
[]
[]
[]
[]
[]
[]
[]
[]
[]
[]
[]
[]
[]
[]
[]
[]
[]
[]
[]
[]
[]
[]
[]
[]
[]
[]
[]
[]
[]
[]
[]
[]
[]
[]
[]
[]
[]
[]
[]
[]
[]
[]
[]
[]
[]
[]
[]
[]
[]
[]
[]
[]
[]
[]
[]
[]
[]
[]
[]
[]
[]
[]
[]
[]
[]
[]
[]
[]
[]
[]
[]
[]
[]
[]
[]
[]
[]
[]
[]
[]
[]
[]
[]
[]
[]
[]
[]
[]
[]
[]
[]
[]
[]
[]
[]
[]
[]
[]
[]
[]
[]
[]
[]
[]
[]
[]
[]
[]
[]
[]
[]
[]
[]
[]
[]
[]
[]
[]
[]
[]
[]
[]
[]
[]
[]
[]
[]
[]
[]
[]
[]
[]
[]
[]
[]
[]
[]
[]
[]
[]
[]
[]
[]
[]
[]
[]
[]
[]
[]
[]
[]
[]
[]
[]
[]
[]
[]
[]
[]
[]
[]
[]
[]
[]
[]
[]
[]
[]
[]
[]
[]
[]
[]
[null,null,null,null,null,null,null,null,null,null,null,null,null,null,null,null,null,{"$f":"IFERROR(INDEX(E$3:E$281,SMALL(IF(#REF!=\"In\",ROW(E$2:E$280)-ROW(G$2)+1),ROW(G538))),\"\")","v":""}]

{"sheet":"Output File","index":32,"n_rows":152,"n_cols":10,"rows_kept":152,"cut":false,"hidden":false,"merged":[]}
[]
[]
[]
[]
[null,"Question No.","Area","Building Block?","Higher level outcome","Lower level outcome","Indicator","Original source","Final framework question","Notes for users"]
[null,"","","","","","","","",""]
[null,"","","","","","","","",""]
[null,"","","","","","","","",""]
[null,"","","","","","","","",""]
[null,"","","","","","","","",""]
[null,"","","","","","","","",""]
[null,"","","","","","","","",""]
[null,"","","","","","","","",""]
[null,"","","","","","","","",""]
[null,"","","","","","","","",""]
[null,"","","","","","","","",""]
[null,"","","","","","","","",""]
[null,"","","","","","","","",""]
[null,"","","","","","","","",""]
[null,"","","","","","","","",""]
[null,"","","","","","","","",""]
[null,"","","","","","","","",""]
[null,"","","","","","","","",""]
[null,"","","","","","","","",""]
[null,"","","","","","","","",""]
[null,"","","","","","","","",""]
[null,"","","","","","","","",""]
[null,"","","","","","","","",""]
[null,"","","","","","","","",""]
[null,"","","","","","","","",""]
[null,"","","","","","","","",""]
[null,"","","","","","","","",""]
[null,"","","","","","","","",""]
[null,"","","","","","","","",""]
[null,"","","","","","","","",""]
[null,"","","","","","","","",""]
[null,"","","","","","","","",""]
[null,"","","","","","","","",""]
[null,"","","","","","","","",""]
[null,"","","","","","","","",""]
[null,"","","","","","","","",""]
[null,"","","","","","","","",""]
[null,"","","","","","","","",""]
[null,"","","","","","","","",""]
[null,"","","","","","","","",""]
[null,"","","","","","","","",""]
[null,"","","","","","","","",""]
[null,"","","","","","","","",""]
[null,"","","","","","","","",""]
[null,"","","","","","","","",""]
[null,"","","","","","","","",""]
[null,"","","","","","","","",""]
[null,"","","","","","","","",""]
[null,"","","","","","","","",""]
[null,"","","","","","","","",""]
[null,"","","","","","","","",""]
[null,"","","","","","","","",""]
[null,"","","","","","","","",""]
[null,"","","","","","","","",""]
[null,"","","","","","","","",""]
[null,"","","","","","","","",""]
[null,"","","","","","","","",""]
[null,"","","","","","","","",""]
[null,"","","","","","","","",""]
[null,"","","","","","","","",""]
[null,"","","","","","","","",""]
[null,"","","","","","","","",""]
[null,"","","","","","","","",""]
[null,"","","","","","","","",""]
[null,"","","","","","","","",""]
[null,"","","","","","","","",""]
[null,"","","","","","","","",""]
[null,"","","","","","","","",""]
[null,"","","","","","","","",""]
[null,"","","","","","","","",""]
[null,"","","","","","","","",""]
[null,"","","","","","","","",""]
[null,"","","","","","","","",""]
[null,"","","","","","","","",""]
[null,"","","","","","","","",""]
[null,"","","","","","","","",""]
[null,"","","","","","","","",""]
[null,"","","","","","","","",""]
[null,"","","","","","","","",""]
[null,"","","","","","","","",""]
[null,"","","","","","","","",""]
[null,"","","","","","","","",""]
[null,"","","","","","","","",""]
[null,"","","","","","","","",""]
[null,"","","","","","","","",""]
[null,"","","","","","","","",""]
[null,"","","","","","","","",""]
[null,"","","","","","","","",""]
[null,"","","","","","","","",""]
[null,"","","","","","","","",""]
[null,"","","","","","","","",""]
[null,"","","","","","","","",""]
[null,"","","","","","","","",""]
[null,"","","","","","","","",""]
[null,"","","","","","","","",""]
[null,"","","","","","","","",""]
[null,"","","","","","","","",""]
[null,"","","","","","","","",""]
[null,"","","","","","","","",""]
[null,"","","","","","","","",""]
[null,"","","","","","","","",""]
[null,"","","","","","","","",""]
[null,"","","","","","","","",""]
[null,"","","","","","","","",""]
[null,"","","","","","","","",""]
[null,"","","","","","","","",""]
[null,"","","","","","","","",""]
[null,"","","","","","","","",""]
[null,"","","","","","","","",""]
[null,"","","","","","","","",""]
[null,"","","","","","","","",""]
[null,"","","","","","","","",""]
[null,"","","","","","","","",""]
[null,"","","","","","","","",""]
[null,"","","","","","","","",""]
[null,"","","","","","","","",""]
[null,"","","","","","","","",""]
[null,"","","","","","","","",""]
[null,"","","","","","","","",""]
[null,"","","","","","","","",""]
[null,"","","","","","","","",""]
[null,"","","","","","","","",""]
[null,"","","","","","","","",""]
[null,"","","","","","","","",""]
[null,"","","","","","","","",""]
[null,"","","","","","","","",""]
[null,"","","","","","","","",""]
[null,"","","","","","","","",""]
[null,"","","","","","","","",""]
[null,"","","","","","","","",""]
[null,"","","","","","","","",""]
[null,"","","","","","","","",""]
[null,"","","","","","","","",""]
[null,"","","","","","","","",""]
[null,"","","","","","","","",""]
[null,"","","","","","","","",""]
[null,"","","","","","","","",""]
[null,"","","","","","","","",""]
[null,"","","","","","","","",""]
[null,"","","","","","","","",""]
[null,"","","","","","","","",""]
[null,"","","","","","","","",""]
[null,"","","","","","","","",""]
[null,"","","","","","","","",""]
[null,"","","","","","","","",""]
[null,"","","","","","","","",""]
[null,"","","","","","","","",""]

{"sheet":"Outcome FW","index":33,"n_rows":103,"n_cols":12,"rows_kept":103,"cut":false,"hidden":false,"merged":[]}
[]
["Area","Building block measure","Q ref","Higher level outcome","Lower level outcome","Indicator","Original source","Status","Final framework question","Can the question be asked via all modes (e.g. self-completion, face to face, phone)?","Adapt for pre/post?","Notes for users"]
["Financial Wellbeing","Y",1,"Current financial wellbeing","Able to live (adequately) within means","Satisfaction with financial circumstances ","FinCap B2","Original","How satisfied are you with your overall financial circumstances? \n\nPlease answer on a scale of 0 to 10, where 0 is ‘not at all satisfied’ and 10 is ‘completely satisfied’ \n\n0 Not at all satisfied\n...\n10 Completely satisfied\nDon’t know","N/A","N/A","Use a visual 0 to 10 scale with the statements indicated attached the extremes.\n"]
["Financial Wellbeing","N",2,"Current financial wellbeing","Able to live (adequately) within means","Regularity of running out of money ","WAS ORunout","Adapted","How often do you and your household run out of money before the end of the week or month or needed to use a credit card or overdraft to get by? Would you say it was ...\n1. Always\n2. Most of the time\n3. Sometimes\n4. Hardly ever\n5. Never\n6. Don’t know","N/A","N/A"]
["Financial Wellbeing","Y",3,"Current financial wellbeing","Able to keep up with bills ","Self-reported keeping up with bills and commitments","Fincap J1","Adapted","Which one of the following statements best describes how well you are keeping up with your bills and credit commitments at the moment? [Please include those you have personally or jointly with your partner/spouse]\nCHOOSE ONE ONLY\n1. Keeping up without any difficulties\n2. It is a struggle from time to time \n3. It is a constant struggle\n4. Falling behind with some bills or credit commitments\n5. Having real financial problems and have fallen behind with many bills or credit commitments  \n6. Don’t have any bills or credit commitments\n7. Don't know\n8. Prefer not to say","N/A","N/A"]
["Financial Wellbeing","Y",4,"Current financial wellbeing","Bills / credit commitments are not a burden ","Self-reported burden of bills and commitments","FinCap",null,"To what extent do you feel that keeping up with your bills and credit commitments is a burden?\n1. It is not a burden at all\n2. It is somewhat of a burden \n3. It is a heavy burden\n4. Don't know\n","N/A","N/A"]
["Financial Wellbeing","N",5,"Current financial wellbeing","Not experiencing material deprivation","Regularity of being unable to pay for essentials ","WB B3","Changed ","How often do you and your household go without essential items due to a lack of money? This might include being unable to pay bills, buy food or pay for heating.\n1. Always\n2. Most of the time\n3. Sometimes\n4. Hardly ever\n5. Never\n6. Don’t know","N/A","N/A"]
["Financial Wellbeing","N",6,"Current financial wellbeing","Not experiencing material deprivation","Number of expenses considered affordable","SILC Afford","Adapted","Looking at this list, can I just check whether your household could afford the following things? \nCHOOSE ALL THAT APPLY\n1. A week's annual holiday away from home\n2. Buying new, rather than second hand, clothes\n3. Keeping your home adequately warm in winter\n4. Having friends or family for a drink or meal once a month\n5. Going out or socialising\n6. A hobby or leisure activity\n7. Replacing a major electrical appliance (e.g. fridge)\n8. Keeping your home in a decent state of decoration\n9. None of these (SINGLE CODE ONLY)","N/A","N/A"]
["Financial Wellbeing","Y",7,"Current financial wellbeing","Able to pay unexpected bills","Capacity to pay an unexpected bill of £300","Fincap I10","Adapted","Thinking about an unexpected bill of £300 that you have to pay within seven days from today, which of the following would you do? \n\nIf you think you would do more than one, please select the main thing you would do, that is the one you would get the most money from.\nCHOOSE ONE ONLY\n1. I  would pay it with my own money, without dipping into savings or cutting back on essentials\n2. I would pay it with my own money, without dipping into savings but I would have to cut back on essentials\n3. I would have to dip into savings \n4. I would use a form of credit (e.g. credit card, take out a loan or make use of an authorised overdraft facility)\n5. I would go overdrawn without authorisation\n6. I would get the money from friends or family as gift or loan\n7. I would have to sell personal/household item(s) to get the money  \n8. I would not be able to pay this expense\n9. Don’t know \n10. Prefer not to say","N/A","N/A"]
["Financial Wellbeing","Y",8,"Longer term financial security","Able to withstand a significant financial shock ","Ratio of savings to income","Genworth","Changed","See means section of framework for savings and income questions","N/A","N/A","You will need to calculate the savings to income ratio for each beneficiary. There are questions in our means section that you can use to capture people’s income and savings – either as an exact amount or using value range. Analysis of the Financial Capability survey for the UK used gross annual income and all savings excluding pensions to calculate the ratio. Remember that if you are using household income you should use household savings to calculate the ratio and likewise for personal income and personal savings. If you are capturing income and savings within a value range (e.g.  £4,500 - £6,499) you can use the middle value to calculate the ratio (e.g. £5499.50). If you would like any help or advice with this, please get in touch.  "]
["Financial Wellbeing","Y",9,"Longer term financial security","Able to withstand a significant financial shock ","Number of insurance and protection products","Fincap E12\n/3","Changed","Which, if any, of the following protection products do you and your partner/spouse have, even if you didn't arrange them yourself? \nCHOOSE ALL THAT APPLY\n1.  Home insurance (covering contents and/or the building)\n2. Insurance for specific items (e.g. white goods, mobile phone)\n3. Payment protection insurance (e.g. for a credit card or mortgage)\n4. Private Medical Insurance (paying or part-paying private hospital or specialist health care)\n5. . Critical illness Insurance (paying a lump sum if you become seriously ill)\n6. Income protection insurance  (providing regular payments if you cannot work due to ill health or accident)\n7. Life insurance that pays out on death\n8. Anther type of insurance\n9. Funeral plan\n10. A will \n11.[OTHER/ADDITIONAL ITEMS]\n12. None of these (SINGLE CODE ONLY)","N/A","N/A","This question might be useful in conjunction with questions on individuals savings to income ratio and capacity to pay an unexpected bill in order to build a picture of your beneficiaries overall resilience to both minor and major financial shocks. "]
["Financial Wellbeing","Y",10,"Longer term financial security","Able to withstand a significant financial shock ","Number of types of longer term savings products ","FinCap G1","Original","Do you currently have savings or investments in any of the following? Please do not include any money that you have saved in a pension. \n1. In a savings account \n2. In an ISA\n3. In a cash / money box\n4. In a credit union account\n5. In a savings club (e.g. Christmas savings club)\n6. Premium bonds\n7. In a current account\n8. In investments/stocks & shares\n9. Other (please specify) \n10. I do not have any savings (SINGLE CODE ONLY)\n11. Prefer not to say (SINGLE CODE ONLY)","N/A","N/A","This question might be useful in conjunction with questions on savings to build a picture of your beneficiaries level of savings. "]
["Financial Wellbeing","Y",11,"Finances and emotional/mental wellbeing","    ","Level of anxiety about finances ","FinCap",null,"To what extent do you agree or disagree with the following statements?\nB. Thinking about my financial situation makes me anxious\n1. Strongly agree\n2. Tend to agree\n3. Neither agree nor disagree\n4. Tend to disagree\n5. Strongly disagree\n6. Don’t know","N/A","N/A"]
["Financial Wellbeing","N",12,"Finances and emotional/mental wellbeing","   ","Effect of finances on mental health ","NI L&T 2000 LoseJob and DAE Q28","Changed","A) To what extent, if at all, do you worry about your current financial situation?\nCHOOSE ONE ONLY\n1. Worry a great deal\n2. Worry to some extent \n3. Worry a little \n4. Don’t worry at all \n5. Don’t know\n\nB) And which of these do you experience because of your or your household's financial situation?\n1. Stress or anxiety\n2. Low mood or depression\n3. Self-harm or suicidal thoughts\n4. Difficulty concentrating or relaxing\n5. Difficulty sleeping\n6. Panic attacks\n7. Family tension or arguments\n8. Domestic abuse or violence\n9. Poor/loss of appetite or eating too much\n10. Increased use of alcohol \n11. Misuse of prescription or over-the-counter drugs\n12. Use of illicit (illegal) drugs or legal highs\n13. Other (specify) \n14. Not experienced any of these\n15. Prefer not to say\n16. Don't know\n","N/A","N/A","Both questions can be asked, but in this order."]
["Financial Wellbeing","N",13,"Confindent about financial future","   ","Level of confidence in future finances ","BASE QCstali ","Adapted","Taking everything into account, how confident are you that you will have enough money to give you the standard of living you hope for in a year from now?\nCHOOSE ONE ONLY\n1. Very confident\n2. Fairly confident\n3. Not very confident\n4. Not at all confident\n5. Don’t know","N/A","N/A"]
["Behaviour","Y",14,"Managing credit use","Reducing the value of unsecured borrowing","Total unsecured borrowing","Fincap E7","Original","If you added up all of your  balances on credit cards, store cards, personal loans, hire purchase, car finance arrangements and student loans, approximately how much do you owe in total? ","N/A","No ","When analysing this data, be aware that borrowing is not always a bad, when at an affordable level. Also it is worth taking into account payment cycles when interpreting your results. Regular credit card users, for example, who pay off their credit cards in full each month, may show an increase in levels of borrowing if the pre measure is taken immediately after making a payment and the post measure is taken just before their payment is due.  Please get in touch if you would like advice on how to manage this. "]
["Behaviour","Y",15,"Managing credit use","Planning how to pay down debt ","Quality of plan for paying down debt ","Fincap D3","Original ","How much of a plan do you have about how you will pay off or reduce my debts?\nPlease answer on a scale of 0 to 10, where 0 means you don’t have a plan of what you need to do and 10 means you have a very specific plan of what you need to do.\n\n- 0 I don’t have a plan of what I need to do\n...\n- 10 I have a very specific plan of what I need to do\n\nDon’t know\n\n","N/A"]
["Behaviour","Y",16,"Managing credit use","Using credit responsibly/sensibly","Approach to credit card repayment ","Fincap E10","Changed","How do you generally handle paying your bill each month for your credit cards or store cards? \n1. I generally make the minimum payment each month, but I pay more than the minimum when I can\n2. I vary in the amount I pay off – between the minimum and the full amount\n3. I usually pay in full, but sometimes let part of the balance roll over to the next month\n4. I always pay in full\n5. Don’t know\n6. Prefer not so say\n","N/A","No","This question might be useful in conjunction with questions on individuals  attitudes to borrowing (see mindset) to build a picture of your beneficiaries borrowing behaviour and inclination to borrow. "]
["Behaviour","N",17,"Managing credit use","Taking steps to tackle problem debt","Steps taken to tackle problem debt","Fincap J4","Changed","PRE: In the last X months, which of the following steps have you taken to reduce the amount of money you owe? This includes any debts you haven’t paid  or late/unpaid bills and credit commitments.\n\nPOST: Since [Reference Point], which of the following steps have you taken to reduce the amount of money you owe? This includes any debts you haven’t paid  or late/unpaid bills and credit commitments.\n\nCHOOSE ALL THAT APPLY\n\n1. Do not have any debts\n2. Increased regular payments\n3. Paid a lump sum towards them\n4. Spoken to the company/companies the money is owed to\n5. Taken independent advice (e.g. from Citizen's Advice Bureau, StepChange, Money Advice Service)\n6. Consolidated loans or credit cards \n7. Set up a Debt Management Plan or Debt Arrangement Scheme\n8. Arranged to write off some or all debts (e.g. applied for bankruptcy or a debt relief order, or set up an IVA)\n9. Other (specify)\n10. None of these, but have debts\n","N/A","Yes","Practitioners can optionally insert additional actions relevant to their intervention prior to code 'None of these'. Actions need to be relevant, clearly stated and as succinct as possible.\n\nPractitioners will need to insert a reference period which is relevant to their intervention and, if using the POST version, change REFERENCE POINT to something relevant to intervention (e.g. since the workshop, or since you last saw us)."]
["Behaviour","Y",18,"Keeping track of income and spending"," ","Accuracy of knowledge about spending money","Fincap F2","Adapted","Which of these best describes how accurately you know how much money you have at present, excluding any savings?  We’re not interested in how much money you have, just how accurately you know how much money you have to spend. \nCHOOSE ONE ONLY\n1. I know within a pound or two\n2. I know within £10 \n3. I know within £50\n4. I know within £100 \n5. I know within £500\n6. I have no idea at all\n\n","N/A","No","This question should be asked before asking other questions about keeping track. \n\nThis question has been adapted from Money Advice Services building blocks of financial capability, based on key driver analysis of the financial capability survey. The measure in the financial capability survey, asks about the balance of their current account, rather than money to spend more generally. \n\nThe original measure was worded as follows:  Which of these best describes how accurately you know the balance on this account?  We’re not interested in how much money is in the account, just how accurately you know how much money you have in the account."]
["Behaviour","Y",19,"Keeping track of income and spending","Keeping track of income and spending","Regularity of checking current account balance","FinCap F5","Original\n\n","How often do you normally check how much money is in your current account?  This could be through getting a mini statement at a bank machine, receiving an automated text message or looking at your account details online. Please choose one option only. \n1. Every day\n2. At least once a week, but not every day\n3. At least once a fortnight, but not once a week\n4. At least once a month, but not once a fortnight\n5. Less than once a month\n6. Other (please specify)\n7. Never\n8. Don’t know\n","N/A"]
["Behaviour","Y",20,"Keeping track of income and spending"," ","Methods used to keep track of income and expenditure","FinCap I5 ","Original ","Which of these do you regularly use to keep track of your income and spending? Please select all that apply. \n1. An online budgeting tool\n2. An App on a mobile or other electronic device\n3. A spreadsheet\n4. A piece of paper\n5. An accounts book or notebook\n6. A financial software package\n7. By checking my bank balance\n8. By reviewing  bank statements\n9. In my head\n10. Other (please specify)\n11.  I don’t keep track\n12. Don’t know \n","N/A",null,"Practitioners can optionally insert additional actions relevant to their intervention prior to code 'Something else'. Actions need to be relevant, clearly stated and as succinct as possible.\n\nPositive change includes movement from 9, 11 and 12 to any other code and / or increasing the number of behaviours they have adopted "]
["Behaviour","N",21,"Keeping track of income and spending","Creating and sticking to a viable budget","Quality of spending plans, frequency of sticking to budget","CitA 3","Original","A) How closely do you normally plan how you will spend your money over the coming week or month? For example by drawing up a budget.\nCHOOSE ONE ONLY\n1. Very closely\n2. Fairly closely\n3. Not very closely\n4. I do not plan my spending at all\n5. Don't know\n\nB) And, how often do you keep to the budget you set?\nCHOOSE ONE ONLY\n1. Always \n2. Most of the time\n3. Sometimes\n4. Hardly ever\n5. Never\n6. Do not budget","N/A","No","Both questions should be used together, in this order."]
["Behaviour","N",22,"Managing bill payments"," ","Frequency of missed bill payments ","DAE Q19","Adapted","How often do you delay or miss paying a bill, beyond the date it becomes due?\nCHOOSE ONE ONLY\n1. I often do this \n2. I occasionally do this \n3. I rarely do this \n4. I never do this","N/A","No"]
["Behaviour","N ",23,"Managing bill payments"," ","Quality of planning to pay bills","BASE Qbplan","Adapted","How well do you usually plan ahead to make sure you have the money to pay for regular bills and expenses? \nCHOOSE ONE ONLY\n1. Plan ahead to cover the full amount\n2. Plan ahead to cover some of the amount\n3. Don't plan ahead because there is always enough money to cover them\n4. Don't plan ahead at all\n","N/A","No"]
["Behaviour","N",24,"Maximising income"," ","Regularity of shopping around to get the best deal  ","NEW","New","When choosing or renewing a product or package, how often do you or your someone else in your household spend time comparing different products or packages? This might include mobile phone contracts, gas and electricity, or insurance.\nCHOOSE ONE ONLY\n1. I/we always spend time comparing\n2. I/we sometimes spend time comparing\n3. I/we very rarely spend time comparing\n4. I/we never spend time comparing\n5. Don’t know\n","N/A","No"]
["Behaviour","N",25,"Maximising income "," ","Steps taken to make money go further","CitA","Adapted","Which of the following things, if any, do you currently do to make your money go further?  \nCHOOSE ALL THAT APPLY\n1. Shop around for food and groceries \n2. Look out for special offers or reduced items\n3. Plan meals in advance \n4. Make a shopping list\n5. Avoid treats and non-essential items\n6. Use money saving tips\n7. Turn lights/power off at home when they are not in use\n8. Check the charges on essential bills such as electricity or phone to see if there is a cheaper tariff or supplier available  \n9. None of these","N/A","No","Practitioners can optionally insert additional actions relevant to their intervention prior to code 'None of these'. Actions need to be relevant, clearly stated and as succinct as possible."]
["Behaviour","N",26,"Maximising income "," ","Claiming benefits and adjusting claim following changes in circumstances","N/A",null,"We have not included a measure of ths behaviour as the actions an individual should take, and when, will differ depending on the their circumstances, the benefits they are claiming and changes to welfare policy.\n\nHouseholds who are claiming benefits must ensure their claim is accurate and up to date following any changes in circumstances, both to ensure that they are getting the full amount they are entitled to and to stop any over-payments, which they might struggle to pay back in the future. \n\nIf your intervention is seeking to maximise beneficiaries' income by supporting them to claim benefits, you might consider using changes to beneficiaries income alongside other administration data (such as whether the advisor helped them to make a claim) to evidence this. Please get in touch with the Money Advice Service if you would like help with deciding how best to measure this outcome.","N/A"]
["Behaviour","Y",27,"Active saving ","Saving on a regular basis","Frequency of saving and amount saved ","FinCap G3 and G4\n\nCitA Q33","Original\n\nChanged","A) Which of these best describes how often you save money? \nCHOOSE ONE ONLY\n1. Every month\n2. Most months\n3. Some months, but not others\n4. Rarely/never\n5. Don’t know\n\nB) Just thinking about the months that you save money is the amount that you save…\n1. Roughly the same each month\n2. A little different from month to month\n3. Very different from month to month\n4. Don’t know\n\nC) About how much on average do you personally manage to save each month, at the moment? \nENTER AMOUNT IN £\nVaries too much to say","N/A","No","These questions are best asked only if an initial question has been asked which defines what we mean by saving (see, for example the question which asks In which of the following ways are you currently putting money aside or saving it for a later time?).  It is advisable to use these questions together as an integrated set."]
["Behaviour","Y",28,"Building resilience","Saving for expected and unexpected expenses","Number of expected and unexpected expenses ","Fincap G7 and G8 adapted ","New","Here is a list of some of the reasons people have said they save. Which, if any, of these are reasons why  you/you and your partner/spouse have savings?  \nPLEASE SELECT ALL THAT APPLY\n1. To pay for planned expenses, purchases or events\n2. In case I have to pay for unexpected expenses/purchases\n3. For a rainy day generally\n4. In case my or my partner/spouse's income changes\n5. For my retirement (excluding paying into a pension)\n6. None of these (SINGLE CODE ONLY)\n7. Don’t know (SINGLE CODE ONLY)\n\nWhat planned expenses, purchases or events are you saving for?\nPLEASE SELECT ALL THAT APPLY\n1. Deposit to rent own home\n2. Deposit to buy own home\n3. Other expenses to move house\n4. A wedding\n5. Starting a family/having another child\n6. Education for me or my partner/spouse\n7. Education for children/grown-up children\n8. Helping grown-up children to rent a home\n9. Helping grown-up children to buy a home\n10. A holiday\n11. Retirement\n12. Home improvements\n13. Purchasing a car/van/motorbike\n14. Other (please specify)\n15. Don’t know (SINGLE CODE ONLY)","N/A","No","Practitioners can choose to use either question or both, remembering to include the preamble once.\n\nSee managing well day to day: active saving for a measure of saving behaviour. \n\nSee means: savings for a measure of the total amount held in savings "]
["Behaviour","Y",101,"Buidling resilience ","Increasing the total amount saved","Amount in personal savings and investments (excluding pension)","Fincap G5","Adapted ","A) Approximately how much, if anything, do you personally have in savings and investments? Please do not include any money that you have saved in a pension. \n1. ENTER EXACT AMOUNT\n2. I do not have any savings and investments\n3. Don’t know \n4. Prefer not to say \n\nB) Could you estimate the total within the following bands?\nCHOOSE ONE ONLY\n1. £100 or less\n2. £101 - £500\n3. £501 - £1,000\n4. £1,001 - £9,999\n5. £10,000 - £19,999\n6. £20,000 or more\n7. Don’t know\n8. Prefer not to say ","N/A"]
["Behaviour","Y",29,"Working towards financial goals "," ","Number of financial goals and quality of plan for achieving goals","Fincap D2 & D3","Original","A) Which, if any, of these financial goals do you have for the next five years?\nPLEASE SELECT ALL THAT APPLY \n1. Just making ends meet day to day\n2. Paying off my debts/reducing debts\n3. Saving money to rent own home\n4. Saving money to buy own home\n5. Saving money for a wedding\n6. Saving money to start a family/have another child\n7. Saving money  for education for me <IF CODE 2 AT A6 and my partner/spouse>\n8. Saving money  for education for children/grown-up children\n9. Saving money  to help grown-up children to rent a home\n10. Saving money  to help grown-up children to buy a home\n11. Saving money for a holiday\n12. Saving money for retirement\n13. Saving money for home improvements\n14. Saving money to purchase a car/van/motorbike\n15. Saving money generally\n16. Other (please specify)\n17. None of these (SINGLE CODE ONLY)\n\nB) How much of a plan do you have about how you will achieve your financial goal for (ANSWER FROM D2)\n\nPlease answer on a scale of 0 to 10, where 0 means you don’t have a plan of what you need to do and 10 means you have a very specific plan of what you need to do…","N/A","No","For paper based survey, consider presenting questions A and B in a grid format in order to capture the level of plan respondents have to achieve each of their goals. "]
["Behaviour","N",30,"Saving for retirement"," ","Whether currently paying into a pension scheme ","Fincap H1","Adapted","Are you currently paying into one or more pensions? This can include an employer or any other type of private pension\nCHOOSE ONE ONLY\n1. Yes\n2. No\n3. I am retired so I am not paying into a pension\n4. Don’t know","N/A","No"]
["Behaviour","N",31,"Saving for retirement"," ","Steps taken to ensure adequate income (for pension or retirement)","NEW","New","PRE. In the last [X] months, which of the following have you done in relation to your pension or retirement income?\n\nPOST. Since [REFERENCE POINT], which of the following have you done in relation to your pension or retirement income? \nCHOOSE ALL THAT APPLY\n\n1. Checked whether my income will be enough to meet my needs in retirement\n2. Increased how much I am paying towards my retirement income\n3. I don't have a pension / source of retirement income\n4. Neither of these\n","N/A","No","Practitioners can change the standard reference period of [X]months for pre-intervention to one relevant to their intervention (which may depend on how acute the advice need is), and should change REFERENCE POINT to reference their intervention (e.g. \"since the workshop\" \"since you last saw\")"]
["Behaviour","N",32,"Proactively seeking advice and guidance "," ","How recently guidance and advice has been used","WAS DBurdW","Adapted","PRE: In the last [SIX] months, which of these have you used for information or advice about your finances?\nPOST: Since [REFERENCE POINT] which of these have you used for information or advice about your finances?\nCHOOSE ALL THAT APPLY\n1. A free advice agency (Money Advice Service, Citizens Advice Bureau, money or debt advice centre, law centre, consumer credit counselling service, National Debtline, benefits office)\n2. An insolvency practitioner\n3. Accountant, bank or other financial adviser\n4. Solicitor or lawyer\n5. Other advice company or person charging a fee\n6. Landlord\n7. Family or friends\n8. Martin Lewis/Money Saving Expert\n9. Price comparison websites e.g. moneysupermarket.com\n10. Other websites\n11. Other (specify)\n12. I haven’t used any of these for advice\n","N/A","See textfill (indicated in [ ] )","Practitioners can change the standard reference period of [six] months for pre-intervention to one relevant to their intervention (which may depend on how acute the advice need is), and should change REFERENCE POINT to reference their intervention (e.g. \"since the workshop\" \"since you last saw\")"]
["Behaviour","N ",33,"Proactively seeking online advice and guidance"," ","How frequently online advice and guidance has been sought","DSK 2.1","Adapted","How often in the last [THREE MONTHS] have you gone online for the following purposes?\n\n- For information or advice on a financial product you needed or wanted\n- To find out whether a financial product was suitable for you\n- To compare financial products to find the best deal for you\n\nCHOOSE ONE FOR EACH\n1. Every day\n2. Every week\n3. Every few weeks\n4. Never \n5. Don’t know","N/A","No","Practitioners can replace [THREE MONTHS] with a reference period which relates to their intervention. \n\nPractitioners may additionally wish to use only those items which relate to their intervention"]
["Connection","N",34,"Exposure and access to appropriate financial advice and guidance","Access to financial advice, guidance and tools which meet their needs in a form and language they can understand, and channel they can use effectively","Ease of access to advice services, either in person or by telephone ","ELSA SC5 and SEG C6","Adapted","How easy or difficult is it for you to do each of the following things?\nCHOOSE ONE ONLY FOR EACH\n-Get to a Citizens Advice Bureau or other advice agency using your normal forms of transport\n-Get to a Jobcentre Plus or local benefit office using your normal forms of transport\n-Use a telephone in private to discuss financial matters\n-Receive confidential financial information by post\n\n1.Very easy\n2.Quite easy\n3.Quite difficult\n4.Very difficult\n5.Unable to go\n6.Do not wish to go","N/A","No","Practitioners can optionally insert additional locations relevant to their intervention at the bottom of the list. Locations need to be relevant, clearly stated and as succinct as possible."]
["Connection","N",35,"Exposure and access to financial products ","Access to appropriate financial products which meet their needs via appropriate channels","Ease of access to banking services, either in person or my mail","ELSA SC5 and SEG C6","Adapted","How easy or difficult is it for you to do each of the folllowing things?\nCHOOSE ONE ONLY FOR EACH\n- Get to a Post Office using your normal forms of transport\n- Get to a Cash point using your normal forms of transport\n- Get to a Bank, building society or credit union using your normal forms of transport\n- Receive confidential financial documents by post, such as a payment card or chequebook\n\n1.Very easy\n2.Quite easy\n3.Quite difficult\n4.Very difficult\n5.Unable to go\n6.Do not wish to go","N/A","No","Practitioners can optionally insert additional locations relevant to their intervention at the bottom of the list. Locations need to be relevant, clearly stated and as succinct as possible.\n\nCould also apply to \"Physical ability to access advice\""]
["Connection","N",36,"Exposure and access to financial products ","Access to appropriate financial products which meet their needs via appropriate channels","Types of banking products held","FRS Showcard N1","Adapted","Which of the following types of everyday accounts do you have, if any, either in your own name or jointly with someone else? These might be held with a bank, building society or other provider such as a credit union or post office. \nCHOOSE ALL THAT APPLY\n1. Current account (usually offered with an overdraft facility, even if you don't want one)\n2. Basic Bank Account (normally without an overdraft facility)\n3. Post Office Card Account (for receiving your pension, benefits or tax credits) \n4. A saving deposit account (e.g. an instant access or notice account, including cash ISA)\n5. None of these","N/A","No"]
["Connection","N",37,"Exposure and access to appropriate financial advice and guidance","Digital access to financial advice, guidance and tools ","Use of the internet to access information about money and finances ","NEW","New","In which of the following ways, if any, can or do you use the internet when you need to access information about money or your finances?\nCHOOSE ALL THAT APPLY\n1. At home, using a computer or laptop\n2. At home, using a mobile phone, tablet or internet-enabled TV\n3. At work, college or at a friend or relative's home\n4. In a library, community centre or other public setting\n5. Somewhere else\n6. Do not use the internet","N/A","No","Practitioners can optionally insert additional locations relevant to their intervention before 'Somewhere else'. Locations need to be relevant, clearly stated and as succinct as possible."]
["Connection","Y",38,"Exposure and access to appropriate financial advice and guidance","Digital access to financial products and services ","Willingness to use the internet to carry out day to day banking","Fincap (O2G)",null,"To what extent do you agree or disagree with the following statement:\n\nI would be happy to use the Internet to carry out day to day banking transactions","N/A"]
["Mindset","Y",39,"Attitudes to  credit use"," ","Preference for saving up rather than borrowing money","Fincap (O2F)","Original","I am now going to read you some things that other people have said about managing money. Please tell me how strongly you agree or disagree with them.\n - I hate to borrow – I would much rather save up in advance","N/A"]
["Mindset","N",40,"Belief that money advice and guidance can help them"," ","Likelihood of seeking money advice and guidance","NEW","New","How likely are you to take advice about dealing with money issues from a free advice organisation to deal with money worries? This could include Citizen's Advice Bureau, Money Advice Service or StepChange.\n\nCHOOSE ONE ONLY\n\n1. Very likely\n2. Fairly likely\n3. Fairly unlikely\n4. Very unlikely\n5. Don’t know\n","N/A","No"]
["Mindset","N",41,"Belief that money advice and guidance can help them"," ","Attitude towards money advice and guidance ","NEW","New","How much do you agree or disagree with each of the following statements? When we say advice and guidance, we mean from organisations like Citizen's Advice Bureau, Money Advice Service or StepChange and also from accountants and independent financial advisers\n\n• Asking for financial advice and guidance seems too scary \n• I’d feel embarrassed to take financial advice and guidance\n• I’d make better financial decisions with financial advice and guidance\n• I can sort out my own money issues, without financial advice and guidance\n• When it comes to things like bank accounts, credit cards or insurance, there’s not enough information out there I can trust\n","N/A","No","If administering on paper/web can set this up s a grid with Agree/Disagree scale along the top"]
["Mindset","N",42,"Confidence communicating with financial professionals "," ","Confidence talking to professionals about money","NEW","New","How confident would you feel talking to people who can give you advice about money\n\n1.Very confident \n2. Fairly confident \n3. Not very confident \n4. Not at all confident\n5. Don't know\n","N/A"]
["Mindset","Y",43,"Saving mindset ","Understand the value of saving for an unexpected event ","Perceived importance of saving for a rainy day","Fincap (O3A)","Original","Thinking overall about your finances, how important do you think it is to save for a rainy day \n\n1. Very important\n2. Fairly important\n3. Neither important nor unimportant\n4. Fairly unimportant\n5. Very unimportant\n6. Don’t know","N/A"]
["Mindset","Y",44,"Saving mindset ","Recognise the importance of future financial needs in retirement","Perceived importance of putting money aside for retirement","Fincap (O3B) ","Original","How important do you think it is to put money aside for your retirement\n\n1. Very important\n2. Fairly important\n3. Neither important nor unimportant\n4. Fairly unimportant\n5. Very unimportant\n6. Don’t know","N/A","no"]
["Mindset","Y",45,"Saving mindset ","Motivated to keep track of finances ","Perceived importance of keeping track of income and expenditure ","Fincap (O3C)","Original","How important do you think it is to keep track of your household’s income and expenditure \n\n1. Very important\n2. Fairly important\n3. Neither important nor unimportant\n4. Fairly unimportant\n5. Very unimportant\n6. Don’t know\n","N/A","No"]
["Mindset","Y",46,"Saving mindset ","Understand the value of making their money go further by shopping around","Perceived importance of shopping around","Fincap (O3D) ","Original","How important do you think it is to shop around in order to make your money go further \n\n1. Very important\n2. Fairly important\n3. Neither important nor unimportant\n4. Fairly unimportant\n5. Very unimportant\n6. Don’t know","N/A","No"]
["Mindset","N",47,"Saving mindset ","Understand the value of making their money go further by shopping around","Attitude to switching suppliers ","NEW","New (except * which is from SEG Q3)","How much do you agree or disagree with each of the following statements?:\n- I prefer to stick with one company over time rather than keep changing suppliers*\n- There's no point switching things like insurance, energy or bank accounts, it's not worth the hassle\n\n1. Strongly agree\n2. Tend to agree\n3. Neither agree nor disagree\n4. Tend to disagree\n5. Strongly disagree\n6. Don’t know\n","N/A","No","If administering on paper/web can set this up s a grid with Agree/Disagree scale along the top"]
["Mindset","Y",48,"Financial confidence","Confident managing money","Level of confidence in managing money","Fincap (B3","Original","How confident do you feel about managing your money?  \n\nPlease answer on a scale of 0 to 10, where 0 is ‘not at all confident and 10 is ‘very confident\n 0…10 scale\nDon't know\n","N/A",null,"Use a visual 0 to 10 scale with the statements indicated attached the extremes."]
["Mindset","Y",49,"Financial confidence","Confident choosing appropriate products/services","Level of confidence in choosing appropriate products/services","Fincap (B4)","Original","How confident do you feel making decisions about financial products and services?  \n\nPlease answer on a scale of 0 to 10, where 0 is ‘not at all confident and 10 is ‘very confident\n 0…10 scale\nDon't know\n","N/A","No","Use a visual 0 to 10 scale with the statements indicated attached the extremes."]
["Mindset","N",50,"Financial confidence","Confident keeping track of income and expenditure","Perceived quality of approach to keeping track of income and expenditure","Fincap (I8)","Original","Thinking overall about your (and your partner/spouse’s) approach to keeping track of income and expenditure, how well do you think this approach works?\n\nPlease answer on a scale of 0 to 10, where 0 means not at all well and 10 means very well\n\n0…10 scale\nDon't know","N/A","No","Use a visual 0 to 10 scale with the statements indicated attached the extremes."]
["Mindset","N",51,"Financial confidence","Confident exercising their own judgment in financial decisions and to question\nsuggestions and advice","Level of confidence dealing with companies and making purchases ","SEG (B1)","Original","How much do you agree or disagree with the following statement?  \n \n- When dealing with companies or making purchases, I would consider myself to be a confident and savvy customer\n \n\n1. Strongly agree\n2. Tend to agree\n3. Neither agree nor disagree\n4. Tend to disagree\n5. Strongly disagree\n6. Don’t know\n","N/A","No"]
["Mindset","N",52,"Financial confidence","Confident exercising their own judgment in financial decisions and to question\nsuggestions and advice","Level of confidence making decisions about pensions","AtP (QA19,21,31)","Original","How much do you agree or disagree with each of the following statements?  \n \n - I know enough about pensions to decide with confidence  how to save for my retirement \n - Sometimes pensions seem so complicated that I cannot really understand the best thing to do \n - Dealing with pensions scares me \n\n1. Strongly agree\n2. Tend to agree\n3. Neither agree nor disagree\n4. Tend to disagree\n5. Strongly disagree\n6. Don’t know","N/A","No","If administering on paper/web can set this up s a grid with Agree/Disagree scale along the top"]
["Mindset","N",53,"Financial confidence","Confident communicating about their situation and needs with financial\nservices professionals.","Level of confidence talking to advice providers ","NEW","New","How confident would you feel talking to people who can give you advice about money\n\n1.Very confident \n2. Fairly confident \n3. Not very confident \n4. Not at all confident\n5. Don't know\n","N/A","No"]
["Mindset","N",54,"Financial confidence"," ","Extent of feeling in control of financial situation\n","NEW","New - untested","How much do you agree or disagree with each of the following statements?  \n \n - I feel in control of my finances\n\n1. Strongly agree\n2. Tend to agree\n3. Neither agree nor disagree\n4. Tend to disagree\n5. Strongly disagree\n6. Don’t know\n \n","N/A","No","If administering on paper/web can set this up s a grid with Agree/Disagree scale along the top"]
["Mindset","Y",55,"Self-controlled spending "," ","Frequency of buying on impulse","Fincap (Q4a)","Changed","O4 To what extent would you say the following statements apply to you personally?\n\nA) I often buy things on impulse\n\n0 does not sound like me\n...\n10 sounds a lot like me\nDon't know\nNot applicable","N/A","No"]
["Mindset","Y",56,"Self-controlled spending "," ","Ability to resist pressures to spend","Fincap (Q4c)","Changed","O4 To what extent would you say the following statements apply to you personally?\n\nB) I feel under pressure to spend like my friends even when I can’t afford it.0 (does not sound like me at all) to 10 (sounds a lot like me)  \n\n\n0 does not sound like me\n...\n10 sounds a lot like me\nDon't know\nNot applicable","N/A","No"]
["Mindset","Y",57,"Financial engagement"," ","Extent of engagement with finances ","Fincap (O2D)","Original","To what extent do you agree or disagree with the\nstatement \n\n\"I prefer to live for today and let tomorrow take care of itself\" \n \"Nothing I do will make much difference to my financial situation\"\n\"I am too busy to sort out my finances at the moment\"\n\n1. Strongly agree\n2. Tend to agree\n3. Neither agree nor disagree\n4. Tend to disagree\n5. Strongly disagree\n6. Don’t know\n","N/A","No"]
["Mindset","Y",58,"Adaptable to changing financial circumstances "," ","Willingness to adjust non-essential spending","Fincap (O4B) ","Original "," I am prepared to adjust the amount of money I spend on non-essentials if my life changes: 0 (does not sound like me at all) to 10 (sounds a lot like me)\n\n0…10 scale\nDon't know","N/A"]
["Mindset","N",59,"Willing to talk openly and honestly about money with friends and family"," ","Willingness to talk about money with friends and family\n","IDL/SEG Q3","Original","How much do you agree or disagree with each of the following statements?  \n\n - I would be too embarrassed to discuss my financial situation\n \n- I would talk to family and friends before making an important financial decision\n\n1. Strongly agree\n2. Tend to agree\n3. Neither agree nor disagree\n4. Tend to disagree\n5. Strongly disagree\n6. Don’t know\n","N/A","No","If administering on paper/web can set this up s a grid with Agree/Disagree scale along the top"]
["Mindset","N",60,"Attitudes to the future ","Recognise the importance of balancing their future financial needs with their current financial needs ","Preference for saving for the future rather than spending now","OECD (f10)/SEG (c44)/ SEG (d35)/BASE (qpla4)","Adapted","How much do you agree or disagree with each of the following statements?  \n\n - I find it more satisfying to spend money than to save it for the long term \n - If I had to choose, I would rather have a good standard of living today than save for the future.\n\n1. Strongly agree\n2. Tend to agree\n3. Neither agree nor disagree\n4. Tend to disagree\n5. Strongly disagree\n6. Don’t know\n","N/A","No","If administering on paper/web can set this up as a grid with Agree/Disagree scale along the top"]
["Mindset","N",61,"Attitudes to the future ","Anticipate and plan for future financial needs including less positive scenarios ","Extent of plans for funding future care needs ","NI Life & Times survey 2010 (careplan/Q15)","Adapted","Have you thought about or made any plans for how you might fund the care and support you may need as you get older? This might include in-home support or a care home.\nCODES 3,4,5,6 CAN BE MULTICODE\n1. I haven't really thought about it\n2. I've thought about it but haven’t done anything specific\n3. I’m saving money which could pay for this (e.g. savings, pension or investments)\n4. I’ve taken out insurance cover to pay for this (e.g. long-term care plan)\n5. I could sell property to pay for this\n6. I hope my family would help fund this\n7. Other (please specify)\n8. Don't know","N/A","No"]
["Mindset","N",62,"Attitudes to the future ","Anticipate and plan for future financial needs including less positive scenarios ","Extent of plans for coping with income loss due to changes in tax or benefits","NI Life & Times survey 2010 (careplan/Q15)","Changed","Have you thought about or made any plans for how you might cope financially with an unexpected fall in your or your household’s income because of changes in tax or benefits?\nCODES 3,4,5,6 CAN BE MULTICODE\n1. I haven't really thought about it\n2. I've thought about it but haven’t done anything specific\n3. I’m saving money which could pay for this (e.g. savings, pension or investments)\n4. I could sell property to pay for this\n5. I hope family would help fund this\n6. Other (please specify)\n7. Don't know\n\n","N/A","No"]
["Mindset","N",63,"Attitudes to the future ","Anticipate and plan for future financial needs including less positive scenarios ","Extent of plans for coping with income loss due to redundancy or ill health","NI Life & Times survey 2010 (careplan/Q15)","Changed","Have you thought about or made any plans for how you might cope financially with an unexpected fall in your or your household’s income because of redundancy or ill-health?\nCODES 3,4,5,6,7 CAN BE MULTICODE\n1. I haven't really thought about it\n2. I've thought about it but haven’t done anything specific\n3. I’m saving money which could pay for this (e.g. savings, pension or investments)\n4. I’ve taken out insurance to pay for this \n5. I could sell property to pay for this\n6. I hope family would help fund this\n7. Other (please specify)\n8. Don't know\n","N/A","No"]
["Mindset","N",64,"Attitudes to the future ","Anticipate and plan for future financial needs including less positive scenarios ","Extent of plans for coping with a rise in mortgage repayments","NI Life & Times survey 2010 (careplan/Q15)","Changed","ONLY IF HAVE A MORTGAGE: 35. Have you thought about or made any plans for how you might cope financially if interest rates rise and your or your household’s mortgage repayments increase?\nCODES 3,4,5,6,7 CAN BE MULTICODE\n1. I haven't really thought about it\n2. I've thought about it but haven’t done anything specific\n3. I’m saving money which could pay for this (e.g. savings, pension or investments)\n4. I would switch to a new mortgage deal\n5. I could sell property to pay for this\n6. I hope family would help fund this\n7. Other (please specify)\n8. This won’t affect me – I’m on a fixed rate mortgage\n9. Don't know\n","N/A","No","For those with a mortgage only"]
["Ability","Y",65,"Financial numeracy","Understand financial concepts and are able to answer basic questions around\ninterest rates","Ability to calculate interest earned from savings\n","Fincap (N3)",null,"QUIZ Suppose you put £100 into a savings account with a guaranteed interest rate of 2% per year. You don’t make any further payments into this account and you don’t withdraw any money.\n\nHow much would be in the account at the end of the first year, once the interest payment is made?\n","Yes  - though best suited to visual presentation, more difficult to administer on the phone","No","Correct answer is £102\n\nFor easier analysis, you may want to consider providing answer codes e.g. \n\n1: A. £120\n2: B. £140\n3: C. £104\n4: D. £102\n\nHowever, this may make it easier for participants to answer and therefore provide an innaccurate picture of their ability. "]
["Ability","N",66,"Financial numeracy","Understand financial concepts and are able to answer basic questions around\ninterest rates","Ability to calculate interest owed on a loan","PDL (Q97a)",null,"QUIZ You have taken out a loan for £500, and the interest rate you are charged is 10 percent per month. There are no other fees. At this interest rate, how much money would you owe in total after one month?\n\nA £505\nB £550\nC £510\nD £600\n","Yes  - though best suited to visual presentation, more difficult to administer on the phone","No","Correct answer B."]
["Ability","Y",67,"Financial numeracy","Understand financial concepts and are able to answer basic questions around\ninflation","Understanding of the impact of inflation on buying power","Fincap (N2)",null,"QUIZ If the inflation rate is 5% and the interest rate you get on your savings is 3%, will your savings have more, less or the same amount of buying power in a year’s time?\n1. More\n2. The same\n3. Less\n4. Don’t know","Yes","No","Correct answer \"Less\"."]
["Ability","N",68,"Understand financial concepts and products  ","Understand different loan types and interest on borrowing","Understanding of loan types and calculating interest","NEW",null,"STEM Which of these statements best describes how knowledgeable you feel about: \n\n- comparing different loans and credit cards\n- credit unions \n- calculating the total cost of a loan or credit such as Brighthouse or a car on hire purchase (including interest and charges)  \n\n1. I have an excellent knowledge\n2. I have a good knowledge\n3. I have a basic knowledge\n4. I know nothing about this\n5. Not applicable","Yes","No","Several Ability indicators in this framework use this question structure. If you select more than one of these indicators, be sure to present these as one question with multiple statements. This can be set up as a grid if used in a web/self -completion setting with statements down the side, responses along the top"]
["Ability","N",69,"Understand financial concepts and products  ","Understand different loan types and interest on borrowing","Understanding of APR","NEW",null,"QUIZ I would like to know whether you think the following statements are true or false.....\n\n - For a six month loan, it will cost you more to borrow money on a loan with a low APR than a loan with a high APR\n\nTrue\nFalse\nDon't know","Yes","No"]
["Ability","N",70,"Understand financial concepts and products ","Understand investments ","Understanding of investments \n\n","OECD (QK7)",null,"QUIZ I would like to know whether you think the following statements are true or false.....\n\n - An investment with a high return is likely to be low risk\n - It is usually possible to reduce the risk of investing in the stock market by buying a wide range of stocks and shares. \n\nTrue\nFalse\nDon't know","Yes","No","Correct answers: False, True, "]
["Ability","N",71,"Understanding financial concepts, products and situations","Understand bank accounts ","Knowledge of bank accounts and ability to check bank balance","NEW",null,"STEM: Which of these statements best describes how knowledgeable you feel about: \n\n- bank accounts\n- checking the balance on your bank account\n\n1. I have an excellent knowledge\n2. I have a good knowledge\n3. I have a basic knowledge\n4. I know nothing about this\n5. Not applicable","Yes","No","Several Ability indicators in this framework use this question structure. If you select more than one of these indicators, be sure to present these as one question with multiple statements. This can be set up as a grid if used in a web/self -completion setting with statements down the side, responses along the top"]
["Ability","N",72,"Understanding financial concepts, products and situations","Understand different insurance products and can assess which options are right for them","Understanding of insurance and ability to compare insurance products\n","NEW",null,"STEM: Which of these statements best describes how knowledgeable you feel about: \n\n- insurance\n- comparing different types of insurance\n\n1. I have an excellent knowledge\n2. I have a good knowledge\n3. I have a basic knowledge\n4. I know nothing about this\n5. Not applicable","Yes","No","Several Ability indicators in this framework use this question structure. If you select more than one of these indicators, be sure to present these as one question with multiple statements. This can be set up as a grid if used in a web/self -completion setting with statements down the side, responses along the top"]
["Ability","N ",73,"Understanding financial concepts, products and situations","Understand different types of savings vehicles, and can assess which options are right for them","Understanding of savings accounts and ability to compare savings products","NEW",null,"STEM: Which of these statements best describes how knowledgeable you feel about: \n- savings accounts \n- credit unions \n- comparing savings products  \n1. I have an excellent knowledge\n2. I have a good knowledge\n3. I have a basic knowledge\n4. I know nothing about this\n5. Not applicable","Yes","No","Several Ability indicators in this framework use this question structure. If you select more than one of these indicators, be sure to present these as one question with multiple statements. This can be set up as a grid if used in a web/self -completion setting with statements down the side, responses along the top"]
["Ability","N",74,"Understanding financial concepts, products and options relevant to their issue, life stage or event","Understand concepts, products and options relavent to their pension","Knowledge of pensions, ability to check and make decisions about pensions\n\n","NEW",null,"STEM: Which of these statements best describes how knowledgeable you feel about: \n- pensions\n- checking how much pension income you will get when you retire\n- making decisions about a pension to give you an income you require in retirement \n1. I have an excellent knowledge\n2. I have a good knowledge\n3. I have a basic knowledge\n4. I know nothing about this\n5. Not applicable","Yes","No","Several Ability indicators in this framework use this question structure. If you select more than one of these indicators, be sure to present these as one question with multiple statements. This can be set up as a grid if used in a web/self -completion setting with statements down the side, responses along the top"]
["Ability","N ",75,"Understanding financial concepts, products and options relevant to their issue, life stage or event","Understand concepts, products and options relevant to their mortgage","Understanding of mortgages and mortgage repayments ","NEW",null,"STEM: Which of these statements best describes how knowledgeable you feel about:  \n- mortgages\n- applying for a mortgage\n- calculating you monthly mortgage repayments if interest rates rise\n1. I have an excellent knowledge\n2. I have a good knowledge\n3. I have a basic knowledge\n4. I know nothing about this\n5. Not applicable","Yes","No","Several Ability questions in this framework use this structure. If you select more than ones of these, be sure to present these as one question with multiple statement. This can be set up as a grid if used in a web/self -completion setting with statements down the side, responses along the top.  "]
["Ability","N",76,"Understanding financial concepts, products and options relevant to their issue, life stage or event","Understand concepts, products and options relevant to problem debt","Knowledge of options and rights in relation to problem debt","DAE (Q25)",null,"STEM: Which of these statements best describes how knowledgeable you feel about:  \n- the different options for sorting out debt problems\n- the fees charged for debt solutions such as bankruptcy, Debt Relief Orders and Debt Management Plans\n- the steps I should take if I’m unable to pay my debts \n- my rights when companies try to recover money I owe them\n- the steps companies can take to recover the money I owe them\n1. I have an excellent knowledge\n2. I have a good knowledge\n3. I have a basic knowledge\n4. I know nothing about this\n5. Not applicable\n\n\n","Yes","No","Several Ability indicators in this framework use this question structure. If you select more than one of these indicators, be sure to present these as one question with multiple statements. This can be set up as a grid if used in a web/self -completion setting with statements down the side, responses along the top"]
["Ability","N",77,"Knowledge of where to go for advice, guidance and tools about their financial situation, in person, by phone and using digital resources"," ","Awareness of different advice providers ","Fincap (F2)",null,"Which, if any, of these providers of advice on your money you have ever heard of, even if you’re not very familiar with them?\n\nSELECT ALL THAT APPLY\n\n1. Money Advice Service\n2.Citizen’s Advice Bureau\n3.Money Sense\n4.Which?\n5.Money Saving Expert (Martin Lewis)\n6.Other price comparison sites (e.g. Moneysupermarket, Comparethemarket)\n7.Directgov (gov.co.uk)\n8. Consumer Credit Counselling Service (CCCS)/StepChange\n9. National Debtline\n[ADD OTHER RELEVANT ORGANISATIONS/SITES]\n11. None of these\n","Yes\n","No","NB - This question only captures awareness of providers and by prompting users there is a risk that reported awareness will not be a reliable indicator of where they would look for information unprompted. Users should consider an open-ended question to capture unprompted awareness \n\nFlexible question: can adapt list as relevant."]
["Ability","N",78,"Knowledge of where to go for advice, guidance and tools about their financial situation, in person, by phone and using digital resources"," ","Knowledge of how to access money advice","NEW",null,"STEM: Which of these statements best describes how knowledgeable you feel about:  \n- where to get  advice if you need help with your finances\n\n1. I have an excellent knowledge\n2. I have a good knowledge\n3. I have a basic knowledge\n4. I know nothing about this\n5. Not applicable","Yes","No","Several Ability indicators in this framework use this question structure. If you select more than one of these indicators, be sure to present these as one question with multiple statements. This can be set up as a grid if used in a web/self -completion setting with statements down the side, responses along the top"]
["Ability","N ",79,"Understanding financial concepts, products and situations","Understand the main types of financial fraud and how to protect themselves from it","Knowledge about types of fraud and ability to protect from fraud ","NEW",null,"STEM: Which of these statements best describes how knowledgeable you feel about:  \n- different types of financial fraud/scams \n- protecting yourself from financial fraud / scams\n- protecting yourself from online financial fraud / scams\n\n1. I have an excellent knowledge\n2. I have a good knowledge\n3. I have a basic knowledge\n4. I know nothing about this\n5. Not applicable\n","Yes","No","Several Ability indicators in this framework use this question structure. If you select more than one of these indicators, be sure to present these as one question with multiple statements. This can be set up as a grid if used in a web/self -completion setting with statements down the side, responses along the top"]
["Ability","N ",80,"Understanding money management","Understand the principles of budgeting and can develop a budget suited to their needs","Ability to create a weekly or monthly budget ","NEW",null,"STEM: Which of these statements best describes how knowledgeable you feel about: \n- creating a weekly or monthly household budget\n\n1. I have an excellent knowledge\n2. I have a good knowledge\n3. I have a basic knowledge\n4. I know nothing about this\n5. Not applicable\n","Yes","No","Several Ability indicators in this framework use this question structure. If you select more than one of these indicators, be sure to present these as one question with multiple statements. This can be set up as a grid if used in a web/self -completion setting with statements down the side, responses along the top"]
["Ability","N",81,"Understanding money management","Knowing how to make their money go further","Ability to use a price comparison site ","NEW",null,"STEM: Which of these statements best describes how knowledgeable you feel about: \n - using a price comparison website \n\n1. I have an excellent knowledge\n2. I have a good knowledge\n3. I have a basic knowledge\n4. I know nothing about this\n5. Not applicable\n\n","Yes","No","Several Ability indicators in this framework use this question structure. If you select more than one of these indicators, be sure to present these as one question with multiple statements. This can be set up as a grid if used in a web/self -completion setting with statements down the side, responses along the top"]
["Ability","N",82,"Understanding money management","Knowing how to make their money go further","Ability to check benefits entitlements and tax payments","NEW",null,"STEM: Which of these statements best describes how knowledgeable you feel about: \n- checking you’re getting all benefits you are entitled to\n- checking you’re paying the correct amount of tax\n\n1. I have an excellent knowledge\n2. I have a good knowledge\n3. I have a basic knowledge\n4. I know nothing about this\n5. Not applicable\n\n","Yes","No","Several Ability indicators in this framework use this question structure. If you select more than one of these indicators, be sure to present these as one question with multiple statements. This can be set up as a grid if used in a web/self -completion setting with statements down the side, responses along the top"]
["Ability","N",83,"Basic skills: Literacy","People have the level of literacy needed to fill in forms and read information about financial products in English (or Welsh in Wales)","Level of literacy ","SKILL (bqwrite)",null,"How good are you at each of the following:\n\na)  writing in English when you need to in daily life? For example: writing letters or notes or filling in official forms?\nb) reading in English when you need to? For example\nreading newspapers and magazines or reading letters, paperwork or forms?\n\n1. Very good \n2. Fairly good \n3. Below average \n4. Poor \n5. No opinion. \n6, Don't Know  ","If someone has literacy problems, then this question may be problematic in a self-completion setting","No"]
["Ability","N",84,"Basic skills: Digital Literacy","Able to use financial/money-related online services eg. forms, tools, emails, and online banking\n","Ability to carry out financial tasks and transactions online ","DSK (2.3)",null,"A) Do you access to the internet at home or elsewhere?\nYes\nNo\nDon't know\n\nIF DO HAVE ACCESS\nB) STEM I’d like you to think about different commercial transactions people do in their everyday lives like banking or shopping. How how knowledgeable you feel about: \na) Buying a product online\nb) Making travel reservations/bookings\nc) Paying bills\nd) Using your bank’s online services\ne) Comparing products and services\nf) Ordering groceries or food online\ng) Selling things online\nh) Finding the location of a house,  office, store or restaurant \n\n1. I have an excellent knowledge\n2. I have a good knowledge\n3. I have a basic knowledge\n4. I know nothing about this\n5. Not applicable","Yes","No"]
["Ability","N",85,"Basic skills: Digital Literacy","Able to navigate online content and locate the information they need","Ability to use the internet","DSK (1.1.3a)",null,"How would you rate your ability to use the\nInternet?\n1. Excellent\n2. Good\n3. Fair\n4. Poor\n5. Bad\n6. Don’t know","Yes","No"]
["Ability","N",86,"Basic skills:Digital literacy","Able to navigate online content and locate the information they need","Ability to find information online\n\n","SEG (P5)",null,"To what extent do you agree or disagree with the following statements?\n\n- When I need information the first place I look is the internet\n - I find it easy to find what I am looking for online\n - I would rather look at information in a paper leaflet than on a company’s website\n\n1. Strongly Agree\n2. Tend to Agree\n3. Tend to disagree\n4. Strongly  disagree\n5. Don’t know\n6. Does not apply to me\n ","Yes","No","You should consider using this question in conjunction with the Connection question on willingness to use digital services to gain a fuller picture of you beneficiaries level of digital inclusion and whether this supports their financial capability. "]
["Ability","N",87,"Basic skills: Communication","Able to confidently interact with others in English (or Welsh in Wales)","Ease of communicating in English or (Welsh in Wales)  ","NEW",null,"Can I check, is English your first language?  Yes/No\n\n[IF NO]  So can I check would you have any difficulty speaking in English to a member of staff in a bank about choosing a financial product?\n1. Yes\n2. No\n\nIF IN WALES: \nCan I check, is English or Welsh your first language?  \nYes - English\nYes - Welsh\nNo, neither\n\n[IF NEITHER]  So can I check would you have any difficulty speaking in English or Welsh to a member of staff in a bank about choosing a financial product?\n1. Yes\n2. No","Yes","No","Can also extend this to include reading and writing in English if not using the basic skills questions above."]
["Means","N",88,"Income","Employment status","N/A","Standard question","Original","Thinking about your employment, what is your current status?\n\nSELECT ONE ONLY\nIF MORE THAN ONE APPLIES, SELECT MAIN STATUS\nIF ON MATERNITY LEAVE FROM EMPLOYER AND PLANNING ON RETURNING COUNT THIS AS WORKING\n1. Working for an employer full-time (that is for 30 or more hours per week)\n2. Working for an employer part-time (that is for less than 30 hours per week)\n3. Self-employed (with or without workers)\n4. Unemployed and looking for work\n5. Unemployed and not looking for work\n6. Retired\n7. Student\n8. Permanently sick / disabled\n9. Temporarily sick \n10. Looking after home\n11. Other \n","N/A","N/A","No"]
["Means","N",89,"Income","Income ","N/A","Fincap P4","Changed","A) Which of the following sources of income, if any, do you currently have? Please include any income you receive personally or jointly with your partner or spouse. \nCHOOSE ALL THAT APPLY  \n1. Income from employment/self-employment (including sick pay)\n2. Income from personal or occupational pensions\n3. Income from savings/investments\n4. Rent you receive from boarders or lodgers (not family members) or other property you rent out or sublet\n5. Child maintenance payments\n6. Other types of payments or maintenance from parents or other family members who you do not live with, including as regular gifts\n7. None of these (SINGLE CODE ONLY)\n8. Don’t know  (SINGLE CODE ONLY)\n9. Prefer not to say  (SINGLE CODE ONLY)\n\nB) And which of the following sources of income do you currently have, if any?\nCHOOSE ALL THAT APPLY  \n1. State Pension\n2. Pension Credit\n3. Child benefit\n4. Universal Credit\n5. Working Tax Credits\n6. Job Seekers Allowance (JSA) \n7. Employment and Support Allowance (ESA)\n8. Income Support \n9. Housing benefit\n10. Council Tax Reduction\n11. Disability Living Allowance (DLA), Personal Independence Payment (PIP) or Attendance Allowance (AA)\n12. Carers Allowance\n13. Something else \n14. None of these (SINGLE CODE ONLY)\n15. Don't know (SINGLE CODE ONLY)\n16. Prefer not to say (SINGLE CODE ONLY)","N/A","N/A","Practitioners can choose to use either or both questions, depending on need."]
["Means","N",90,"Income","Income ","N/A","Fincap P1","Adapted ","Which band from the grid below does your household’s total gross income from all sources fall into?\n[INCOME is any money from work, including a second job or occasional work, and any other sources, such as benefits, pensions, savings and investments, maintenance payments and rent from property or subletting.]\nGROSS means the amount you receive before any deductions, income tax, National Insurance etc. \nCHOOSE ONE ONLY\n Per Week Per Month Per Year\n1. Up to £86 Up to £374 Under £4,500\n2. £87 - £124 £375 - £541 £4,500 - £6,499\n3.  £125 - £143 £542 - £624 £6,500 - £7,499\n4.  £144 - £182 £625 - £791 £7,500 - £9,499\n5. £183 - £220 £792 - £957 £9,500 - £11,499\n6. £221 - £259 £958 - £1,124 £11,500 - £13,499\n7.  £260 - £297 £1,125 - £1,291 £13,500 - £15,499\n8.  £298 - £336 £1,292 - £1,457 £15,500 - £17,499\n9.  £337 - £384 £1,458 - £1,666 £17,500 - £19,999\n10.  £385 - £480 £1,667 - £2,082 £20,000 - £24,999\n11. £481 - £576 £2,083 - £2,499 £25,000 - £29,999\n12. £577 - £672 £2,500 - £2,916 £30,000 - £34,999\n13. £673 - £768 £2,917 - £3,332 £35,000 - £39,999\n14. £769 - £961 £3,333 - £4,166 £40,000 - £49,999\n15 £962 - £1,441 £4,167 - £6,249 £50,000 - £74,999\n16.  £1,442 - £1,922 £6,250 - £8,332 £75,000 - £99,999\n17. £1,923+ £8,333+ £100,000+\n18. Don’t know\n19. Prefer not to say ","N/A","N/A","The text shown in [green text] is optional and need only be asked if questions about sources of income have not been asked.\n\nUsers can alternatively ask for a precise figure or specify by week, month or year, depending on the nature and needs of the client."]
["Means","N",91,"Income","Income ","N/A","NEW","NEW","POST\nBy how much has your income increased since [REFERENCE POINT]?\n1. ENTER AMOUNT IN £\n2. Stayed the same\n3. Has fallen\n4. Don't know\n5. Prefer not to say","N/A","N/A","Suitable for use post-intervention only. Practitioners should replace [REFERENCE POINT] with something appropriate to their intervention (such as 'since the workshop' or 'since you last saw us')"]
["Means","N",92,"Income","Income ","N/A","Fincap P3","Original","Which one of these best applies to you personally?\n1. Pay income tax at a basic rate\n2. Pay income tax at a higher rate\n3. Do not pay income tax\n4. Don’t know\n5. Prefer not to say","N/A","N/A"]
["Means","N",93,"Savings","Savings","N/A","Fincap G5","Adapted ","A) Approximately how much, if anything, do you personally have in savings and investments? Please do not include any money that you have saved in a pension. \n1. ENTER EXACT AMOUNT\n2. I do not have any savings and investments\n3. Don’t know \n4. Prefer not to say \n\nB) Could you estimate the total within the following bands?\nCHOOSE ONE ONLY\n1. £100 or less\n2. £101 - £500\n3. £501 - £1,000\n4. £1,001 - £9,999\n5. £10,000 - £19,999\n6. £20,000 or more\n7. Don’t know\n8. Prefer not to say ","N/A","N/A","B will not be necessary if client has been able to answer 1 or 2 at A\n\nUsers can alternatively go straight to the banded answers, depending on the nature and needs of the client.\n\nFor clients living with partners or in households where savings are jointly held, this question can be ammended to capture total household savings. "]
["Means","N",94,"Savings","Savings","N/A","PDL Qsav","Adapted ","Please can you tell me whether you currently have money saved in any of the following types of savings accounts and investments, including any joint accounts? CHOOSE ALL THAT APPLY\n1. A savings or deposit account with a bank or building society\n2. An account with a Credit Union\n3. Cash ISA\n4. Premium bonds\n5. Stocks and shares\n6. Other savings products\n7. Other investment product (not including pension)\n8. None of these (SINGLE CODE ONLY)\n9. Don't know (SINGLE CODE ONLY)\n10. Prefer not to say (SINGLE CODE ONLY)","N/A","N/A"]
["Means","N",95,"Other assets","Other assets ","N/A","ELSA IAPROP and SEG N6","Adapted ","A) Which, if any, of these assets do you have, not including your own home? Please include any in your sole name or jointly owned with someone else\nCHOOSE ALL THAT APPLY. \n1. Houses, flats or holiday homes, including timeshares (not including this home) \n2. Farm or Business Property (such as a shop, warehouse or garage) \n3. Other land \n4. Cars, motorbikes, boats and other motor vehicles\n5. Money owed to you by others \n6. Money held in a trust \n7. Art, antiques, collectables, jewellery, and other valuables\n8. Other assets\n9. None of these (SINGLE CODE ONLY)\n10. Don't know (SINGLE CODE ONLY)\n11. Prefer not to say (SINGLE CODE ONLY)\n\nB) How much, in total, do you think they are currently worth? We only need your best estimate if you are unsure. \nCHOOSE ONE ONLY\n1. Less than £30,000 \n2. £30,000 to £39,999\n3. £40,000 to £49,999\n4. £50,000 to £74,999\n5. £75,000 to £99,999\n6. £100,000 to £149,999\n7. £150,000 to £199,999\n8. £200,000 to £249,999\n9. £250,000 to £500,000\n10. £500,000+\n11. Don't know (SINGLE CODE ONLY)\n12. Prefer not to say (SINGLE CODE ONLY)","N/A","N/A","This should be last question asked in relation to Other Assets"]
["Means","N",96,"Other assets","Other assets ","N/A","WAS Ten1\nSEG F21\nWAS Hvalue","Original","A) In which of these ways do you (and your household) occupy your home?\n1. Own it outright\n2. Buying it with the help of a mortgage or loan\n3. Pay part rent and part mortgage (shared ownership)\n4. Rent it\n5. Live here rent-free (including rent-free in relative's/friend's property; excluding\nsquatting)\n6. Squatting\n\nB) And how much in total is left to pay on your mortgage (or mortgages, if you have more than one). If you are unsure, please give your best estimate.\nCHOOSE ONE ONLY\n1. Less than £10,000\n2. £10,000 to £19,999\n3. £20,000 to £29,999\n4. £30,000 to £39,999\n5. £40,000 to £49,999\n6. £50,000 to £74,999\n7. £75,000 to £99,999\n8. £100,000\n9. to £149,999\n10. £150,000 to £199,999\n11. £200,000 to £249,999\n12. £250,000 to £299,999\n13. £300,000 to £399,999\n14. £400,000 to £499,999\n15. £500,000 or more\n16. Don't know\n17. Prefer not to say\n\nC) About how much would you expect to get (in total and not just your share) for your current home if you sold it today (before paying off any outstanding mortgage or loan on the property)?\nCHOOSE ONE ONLY\nENTER AMOUNT IN £s  If DK, then asked banded question: \n1. Less than £60,000\n2. £60,000 to £99,999\n3. £100,000 to £149.999\n4. £150,000 to £199,999\n5. £200,000 to £249,999\n6. £250,000 to £299,999\n7. £300,000 to £349,999\n8. £350,000 to £399,999\n9. £400,000 to £499,999\n10. £500,000 to £749,999\n11. £750,000 to £999,999\n12. £1 million or more ","N/A","N/A","Question B should only be asked if choosing 2 or 3 at A.\n\nAt Question B, users can alternatively asked for a precise figure, depending on the nature of the client.\n\nQuestion C should only be asked if choosing 1, 2 or 3 at A\n\n"]
["Means","N",97,"Access to affordable credit ","Access to affordable credit ","N/A","HCC 8.9","Adapted ","Please can you tell me which of the following you have had in the last [3 months], whether in your own name or jointly with someone else? Please include any that you are in arrears with.\n1. Credit or store card\n2. Overdraft \n3. Payday loan\n3. Loan from company that collects payments from your home (e.g. Provident, Greenwoods)\n5. Loan from a pawnbroker\n7. Loan from a Credit Union or other community finance organisation\n8. A loan from a friend or relative.\n9. Loan from the Social Fund\n10. Loan from an unlicensed lender who charges interest, sometimes called a loan shark\n11. Any other type of loan from a bank, building society or finance company e.g. Norton Finance, Blackhorse car finance\n11) Something else\n12) Don't know\n13) Prefer not to say","N/A","N/A","Practitioners can amend the 3 months shown to a reference period which is in keeping with their intervention and following period."]
["Ability","N",98,"Committed expenditure","Additional outgoings","Number of additional high-value monthly outgoings","Fincap K2","Adapted","Do you (and your partner if you have one) regularly spend more than £200 a month on any of the following items? \nCHOOSE ALL THAT APPLY \n1. Travel to work\n2. Rent paid because you work away from home and cannot claim it back\n3. Child care\n4. School fees\n5. Care for someone else (including nursing home)\n6. Financial support to a partner, child or other family member who does not live with you\n7. None of these (SINGLE CODE ONLY)\n8. Don’t know (SINGLE CODE ONLY)\n9. Prefer not to say (SINGLE CODE ONLY)","N/A","No"]
["Ability","N",99,"Committed expenditure","Additional outgoings","Number of additional high-value monthly outgoings that are more than budget allows for","Fincap K2","Changed","Do you (and your partner if you have one) regularly spend more than you can afford on any of the following items? \nPLEASE SELECT ALL THAT APPLY \n1. Travel to work\n2. Rent paid because you work away from home and cannot claim it back\n3. Child care\n4. School fees\n5. Care for someone else (including nursing home)\n6. Financial support to a partner, child or other family member who does not live with you\n7. Paying off credit or store cards \n8. Paying for goods bought on hire purchase or mail order\n8. None of these (SINGLE CODE ONLY)","N/A","No"]
["Ability","N",100,"Committed expenditure","Dependent children","Number of dependent children","WB C12b","Adapted","How many children depend on you financially?","N/A","No"]

{"sheet":"Template","index":34,"n_rows":108,"n_cols":7,"rows_kept":108,"cut":false,"hidden":false,"merged":[[6,6,6,7]]}
[]
[null,null,"Adult Outcome Frameworks"]
[]
[null,"Financial Wellbeing - ****"]
[null,"Select the questions that are relevant to your intervention -  use the first question for each indicator, "]
[null,"only use additional questions if that indicator is particularly important."]
[null,"Higher level outcome","Lower level outcome","Indicator","Question","Building Block Y/N","Question"]
[null,"Current financial wellbeing","Able to live (adequately) within means","Satisfaction with financial circumstances ","How satisfied are you with your overall financial circumstances? \n\nPlease answer on a scale of 0 to 10, where 0 is ‘not at all satisfied’ and 10 is ‘completely satisfied’ \n\n0 Not at all satisfied\n...\n10 Completely satisfied\nDon’t know","Y",1]
[null,"Current financial wellbeing","Able to live (adequately) within means","Regularity of running out of money ","How often do you and your household run out of money before the end of the week or month or needed to use a credit card or overdraft to get by? Would you say it was ...\n1. Always\n2. Most of the time\n3. Sometimes\n4. Hardly ever\n5. Never\n6. Don’t know","N",2]
[null,"Current financial wellbeing","Able to keep up with bills ","Self-reported keeping up with bills and commitments","Which one of the following statements best describes how well you are keeping up with your bills and credit commitments at the moment? [Please include those you have personally or jointly with your partner/spouse]\nCHOOSE ONE ONLY\n1. Keeping up without any difficulties\n2. It is a struggle from time to time \n3. It is a constant struggle\n4. Falling behind with some bills or credit commitments\n5. Having real financial problems and have fallen behind with many bills or credit commitments  \n6. Don’t have any bills or credit commitments\n7. Don't know\n8. Prefer not to say","Y",3]
[null,"Current financial wellbeing","Bills / credit commitments are not a burden ","Self-reported burden of bills and commitments","To what extent do you feel that keeping up with your bills and credit commitments is a burden?\n1. It is not a burden at all\n2. It is somewhat of a burden \n3. It is a heavy burden\n4. Don't know\n","Y",4]
[null,"Current financial wellbeing","Not experiencing material deprivation","Regularity of being unable to pay for essentials ","How often do you and your household go without essential items due to a lack of money? This might include being unable to pay bills, buy food or pay for heating.\n1. Always\n2. Most of the time\n3. Sometimes\n4. Hardly ever\n5. Never\n6. Don’t know","N",5]
[null,"Current financial wellbeing","Not experiencing material deprivation","Number of expenses considered affordable","Looking at this list, can I just check whether your household could afford the following things? \nCHOOSE ALL THAT APPLY\n1. A week's annual holiday away from home\n2. Buying new, rather than second hand, clothes\n3. Keeping your home adequately warm in winter\n4. Having friends or family for a drink or meal once a month\n5. Going out or socialising\n6. A hobby or leisure activity\n7. Replacing a major electrical appliance (e.g. fridge)\n8. Keeping your home in a decent state of decoration\n9. None of these (SINGLE CODE ONLY)","N",6]
[null,"Current financial wellbeing","Able to pay unexpected bills","Capacity to pay an unexpected bill of £300","Thinking about an unexpected bill of £300 that you have to pay within seven days from today, which of the following would you do? \n\nIf you think you would do more than one, please select the main thing you would do, that is the one you would get the most money from.\nCHOOSE ONE ONLY\n1. I  would pay it with my own money, without dipping into savings or cutting back on essentials\n2. I would pay it with my own money, without dipping into savings but I would have to cut back on essentials\n3. I would have to dip into savings \n4. I would use a form of credit (e.g. credit card, take out a loan or make use of an authorised overdraft facility)\n5. I would go overdrawn without authorisation\n6. I would get the money from friends or family as gift or loan\n7. I would have to sell personal/household item(s) to get the money  \n8. I would not be able to pay this expense\n9. Don’t know \n10. Prefer not to say","Y",7]
[null,"Longer term financial security","Able to withstand a significant financial shock ","Ratio of savings to income","See means section of framework for savings and income questions","Y",8]
[null,"Longer term financial security","Able to withstand a significant financial shock ","Number of insurance and protection products","Which, if any, of the following protection products do you and your partner/spouse have, even if you didn't arrange them yourself? \nCHOOSE ALL THAT APPLY\n1.  Home insurance (covering contents and/or the building)\n2. Insurance for specific items (e.g. white goods, mobile phone)\n3. Payment protection insurance (e.g. for a credit card or mortgage)\n4. Private Medical Insurance (paying or part-paying private hospital or specialist health care)\n5. . Critical illness Insurance (paying a lump sum if you become seriously ill)\n6. Income protection insurance  (providing regular payments if you cannot work due to ill health or accident)\n7. Life insurance that pays out on death\n8. Anther type of insurance\n9. Funeral plan\n10. A will \n11.[OTHER/ADDITIONAL ITEMS]\n12. None of these (SINGLE CODE ONLY)","Y",9]
[null,"Longer term financial security","Able to withstand a significant financial shock ","Number of types of longer term savings products ","Do you currently have savings or investments in any of the following? Please do not include any money that you have saved in a pension. \n1. In a savings account \n2. In an ISA\n3. In a cash / money box\n4. In a credit union account\n5. In a savings club (e.g. Christmas savings club)\n6. Premium bonds\n7. In a current account\n8. In investments/stocks & shares\n9. Other (please specify) \n10. I do not have any savings (SINGLE CODE ONLY)\n11. Prefer not to say (SINGLE CODE ONLY)","Y",10]
[null,"Finances and emotional/mental wellbeing",0,"Level of anxiety about finances ","To what extent do you agree or disagree with the following statements?\nB. Thinking about my financial situation makes me anxious\n1. Strongly agree\n2. Tend to agree\n3. Neither agree nor disagree\n4. Tend to disagree\n5. Strongly disagree\n6. Don’t know","Y",11]
[null,"Finances and emotional/mental wellbeing",0,"Effect of finances on mental health ","A) To what extent, if at all, do you worry about your current financial situation?\nCHOOSE ONE ONLY\n1. Worry a great deal\n2. Worry to some extent \n3. Worry a little \n4. Don’t worry at all \n5. Don’t know\n\nB) And which of these do you experience because of your or your household's financial situation?\n1. Stress or anxiety\n2. Low mood or depression\n3. Self-harm or suicidal thoughts\n4. Difficulty concentrating or relaxing\n5. Difficulty sleeping\n6. Panic attacks\n7. Family tension or arguments\n8. Domestic abuse or violence\n9. Poor/loss of appetite or eating too much\n10. Increased use of alcohol \n11. Misuse of prescription or over-the-counter drugs\n12. Use of illicit (illegal) drugs or legal highs\n13. Other (specify) \n14. Not experienced any of these\n15. Prefer not to say\n16. Don't know\n","N",12]
[null,"Confindent about financial future",0,"Level of confidence in future finances ","Taking everything into account, how confident are you that you will have enough money to give you the standard of living you hope for in a year from now?\nCHOOSE ONE ONLY\n1. Very confident\n2. Fairly confident\n3. Not very confident\n4. Not at all confident\n5. Don’t know","N",13]
[null,"Managing credit use","Reducing the value of unsecured borrowing","Total unsecured borrowing","If you added up all of your  balances on credit cards, store cards, personal loans, hire purchase, car finance arrangements and student loans, approximately how much do you owe in total? ","Y",14]
[null,"Managing credit use","Planning how to pay down debt ","Quality of plan for paying down debt ","How much of a plan do you have about how you will pay off or reduce my debts?\nPlease answer on a scale of 0 to 10, where 0 means you don’t have a plan of what you need to do and 10 means you have a very specific plan of what you need to do.\n\n- 0 I don’t have a plan of what I need to do, I just know I want to do it\n...\n- 10 I have a very specific plan of what I need to do\n\nDon’t know\n\n","Y",15]
[null,"Managing credit use","Using credit responsibly/sensibly","Approach to credit card repayment ","How do you generally handle paying your bill each month for your credit cards or store cards? \n1. I generally make the minimum payment each month, but I pay more than the minimum when I can\n2. I vary in the amount I pay off – between the minimum and the full amount\n3. I usually pay in full, but sometimes let part of the balance roll over to the next month\n4. I always pay in full\n5. Don’t know\n6. Prefer not so say\n","Y",16]
[null,"Managing credit use","Taking steps to tackle problem debt","Steps taken to tackle problem debt","PRE: In the last X months, which of the following steps have you taken to reduce the amount of money you owe? This includes any debts you haven’t paid  or late/unpaid bills and credit commitments.\n\nPOST: Since [Reference Point], which of the following steps have you taken to reduce the amount of money you owe? This includes any debts you haven’t paid  or late/unpaid bills and credit commitments.\n\nCHOOSE ALL THAT APPLY\n\n1. Do not have any debts\n2. Increased regular payments\n3. Paid a lump sum towards them\n4. Spoken to the company/companies the money is owed to\n5. Taken independent advice (e.g. from Citizen's Advice Bureau, StepChange, Money Advice Service)\n6. Consolidated loans or credit cards \n7. Set up a Debt Management Plan or Debt Arrangement Scheme\n8. Arranged to write off some or all debts (e.g. applied for bankruptcy or a debt relief order, or set up an IVA)\n9. Other (specify)\n10. None of these, but have debts\n","N",17]
[null,"Keeping track of income and spending",0,"Accuracy of knowledge about spending money","Which of these best describes how accurately you know how much money you have at present, excluding any savings?  We’re not interested in how much money you have, just how accurately you know how much money you have to spend. \nCHOOSE ONE ONLY\n1. I know within a pound or two\n2. I know within £10 \n3. I know within £50\n4. I know within £100 \n5. I know within £500\n6. I have no idea at all\n\n","Y",18]
[null,"Keeping track of income and spending","Keeping track of income and spending","Regularity of checking current account balance","How often do you normally check how much money is in your current account?  This could be through getting a mini statement at a bank machine, receiving an automated text message or looking at your account details online. Please choose one option only. \n1. Every day\n2. At least once a week, but not every day\n3. At least once a fortnight, but not once a week\n4. At least once a month, but not once a fortnight\n5. Less than once a month\n6. Other (please specify)\n7. Never\n8. Don’t know\n","Y",19]
[null,"Keeping track of income and spending",0,"Methods used to keep track of income and expenditure","Which of these do you regularly use to keep track of your income and spending? Please select all that apply. \n1. An online budgeting tool\n2. An App on a mobile or other electronic device\n3. A spreadsheet\n4. A piece of paper\n5. An accounts book or notebook\n6. A financial software package\n7. By checking my bank balance\n8. By reviewing  bank statements\n9. In my head\n10. Other (please specify)\n11.  I don’t keep track\n12. Don’t know \n","Y",20]
[null,"Keeping track of income and spending","Creating and sticking to a viable budget","Quality of spending plans, frequency of sticking to budget","A) How closely do you normally plan how you will spend your money over the coming week or month? For example by drawing up a budget.\nCHOOSE ONE ONLY\n1. Very closely\n2. Fairly closely\n3. Not very closely\n4. I do not plan my spending at all\n5. Don't know\n\nB) And, how often do you keep to the budget you set?\nCHOOSE ONE ONLY\n1. Always \n2. Most of the time\n3. Sometimes\n4. Hardly ever\n5. Never\n6. Do not budget","N",21]
[null,"Managing bill payments",0,"Frequency of missed bill payments ","How often do you delay or miss paying a bill, beyond the date it becomes due?\nCHOOSE ONE ONLY\n1. I often do this \n2. I occasionally do this \n3. I rarely do this \n4. I never do this","N",22]
[null,"Managing bill payments",0,"Quality of planning to pay bills","How well do you usually plan ahead to make sure you have the money to pay for regular bills and expenses? \nCHOOSE ONE ONLY\n1. Plan ahead to cover the full amount\n2. Plan ahead to cover some of the amount\n3. Don't plan ahead because there is always enough money to cover them\n4. Don't plan ahead at all\n","N ",23]
[null,"Maximising income",0,"Regularity of shopping around to get the best deal  ","When choosing or renewing a product or package, how often do you or your someone else in your household spend time comparing different products or packages? This might include mobile phone contracts, gas and electricity, or insurance.\nCHOOSE ONE ONLY\n1. I/we always spend time comparing\n2. I/we sometimes spend time comparing\n3. I/we very rarely spend time comparing\n4. I/we never spend time comparing\n5. Don’t know\n","N",24]
[null,"Maximising income ",0,"Steps taken to make money go further","Which of the following things, if any, do you currently do to make your money go further?  \nCHOOSE ALL THAT APPLY\n1. Shop around for food and groceries \n2. Look out for special offers or reduced items\n3. Plan meals in advance \n4. Make a shopping list\n5. Avoid treats and non-essential items\n6. Use money saving tips\n7. Turn lights/power off at home when they are not in use\n8. Check the charges on essential bills such as electricity or phone to see if there is a cheaper tariff or supplier available  \n9. None of these","N",25]
[null,"Maximising income ",0,"Claiming benefits and adjusting claim following changes in circumstances","See user note","N",26]
[null,"Active saving ","Saving on a regular basis","Frequency of saving and amount saved ","A) Which of these best describes how often you save money? \nCHOOSE ONE ONLY\n1. Every month\n2. Most months\n3. Some months, but not others\n4. Rarely/never\n5. Don’t know\n\nB) Just thinking about the months that you save money is the amount that you save…\n1. Roughly the same each month\n2. A little different from month to month\n3. Very different from month to month\n4. Don’t know\n\nC) About how much on average do you personally manage to save each month, at the moment? \nENTER AMOUNT IN £\nVaries too much to say","Y",27]
[null,"Building resilience","Saving for expected and unexpected expenses","Number of expected and unexpected expenses ","Here is a list of some of the reasons people have said they save. Which, if any, of these are reasons why  you/you and your partner/spouse have savings?  \nPLEASE SELECT ALL THAT APPLY\n1. To pay for planned expenses, purchases or events\n2. In case I have to pay for unexpected expenses/purchases\n3. For a rainy day generally\n4. In case my or my partner/spouse's income changes\n5. For my retirement (excluding paying into a pension)\n6. None of these (SINGLE CODE ONLY)\n7. Don’t know (SINGLE CODE ONLY)\n\nWhat planned expenses, purchases or events are you saving for?\nPLEASE SELECT ALL THAT APPLY\n1. Deposit to rent own home\n2. Deposit to buy own home\n3. Other expenses to move house\n4. A wedding\n5. Starting a family/having another child\n6. Education for me or my partner/spouse\n7. Education for children/grown-up children\n8. Helping grown-up children to rent a home\n9. Helping grown-up children to buy a home\n10. A holiday\n11. Retirement\n12. Home improvements\n13. Purchasing a car/van/motorbike\n14. Other (please specify)\n15. Don’t know (SINGLE CODE ONLY)","Y",28]
[null,"Buidling resilience ","Increasing the total amount saved","Amount in personal savings and investments (excluding pension)","A) Approximately how much, if anything, do you personally have in savings and investments? Please do not include any money that you have saved in a pension. \n1. ENTER EXACT AMOUNT\n2. I do not have any savings and investments\n3. Don’t know \n4. Prefer not to say \n\nB) Could you estimate the total within the following bands?\nCHOOSE ONE ONLY\n1. £100 or less\n2. £101 - £500\n3. £501 - £1,000\n4. £1,001 - £9,999\n5. £10,000 - £19,999\n6. £20,000 or more\n7. Don’t know\n8. Prefer not to say ","Y",101]
[null,"Working towards financial goals ",0,"Number of financial goals and quality of plan for achieving goals","A) Which, if any, of these financial goals do you have for the next five years?\nPLEASE SELECT ALL THAT APPLY \n1. Just making ends meet day to day\n2. Paying off my debts/reducing debts\n3. Saving money to rent own home\n4. Saving money to buy own home\n5. Saving money for a wedding\n6. Saving money to start a family/have another child\n7. Saving money  for education for me <IF CODE 2 AT A6 and my partner/spouse>\n8. Saving money  for education for children/grown-up children\n9. Saving money  to help grown-up children to rent a home\n10. Saving money  to help grown-up children to buy a home\n11. Saving money for a holiday\n12. Saving money for retirement\n13. Saving money for home improvements\n14. Saving money to purchase a car/van/motorbike\n15. Saving money generally\n16. Other (please specify)\n17. None of these (SINGLE CODE ONLY)\n\nB) How much of a plan do you have about how you will achieve your financial goal for (ANSWER FROM D2)\n\nPlease answer on a scale of 0 to 10, where 0 means you don’t have a plan of what you need to do and 10 means you have a very specific plan of what you need to do…","Y",29]
[null,"Saving for retirement",0,"Whether currently paying into a pension scheme ","Are you currently paying into one or more pensions? This can include an employer or any other type of private pension\nCHOOSE ONE ONLY\n1. Yes\n2. No\n3. I am retired so I am not paying into a pension\n4. Don’t know","N",30]
[null,"Saving for retirement",0,"Steps taken to ensure adequate income (for pension or retirement)","PRE. In the last [X] months, which of the following have you done in relation to your pension or retirement income?\n\nPOST. Since [REFERENCE POINT], which of the following have you done in relation to your pension or retirement income? \nCHOOSE ALL THAT APPLY\n\n1. Checked whether my income will be enough to meet my needs in retirement\n2. Increased how much I am paying towards my retirement income\n3. I don't have a pension / source of retirement income\n4. Neither of these\n","N",31]
[null,"Proactively seeking advice and guidance ",0,"How recently guidance and advice has been used","PRE: In the last [SIX] months, which of these have you used for information or advice about your finances?\nPOST: Since [REFERENCE POINT] which of these have you used for information or advice about your finances?\nCHOOSE ALL THAT APPLY\n1. A free advice agency (Money Advice Service, Citizens Advice Bureau, money or debt advice centre, law centre, consumer credit counselling service, National Debtline, benefits office)\n2. An insolvency practitioner\n3. Accountant, bank or other financial adviser\n4. Solicitor or lawyer\n5. Other advice company or person charging a fee\n6. Landlord\n7. Family or friends\n8. Martin Lewis/Money Saving Expert\n9. Price comparison websites e.g. moneysupermarket.com\n10. Other websites\n11. Other (specify)\n12. I haven’t used any of these for advice\n","N",32]
[null,"Proactively seeking online advice and guidance",0,"How frequently online advice and guidance has been sought","How often in the last [THREE MONTHS] have you gone online for the following purposes?\n\n- For information or advice on a financial product you needed or wanted\n- To find out whether a financial product was suitable for you\n- To compare financial products to find the best deal for you\n\nCHOOSE ONE FOR EACH\n1. Every day\n2. Every week\n3. Every few weeks\n4. Never \n5. Don’t know","N ",33]
[null,"Exposure and access to appropriate financial advice and guidance","Access to financial advice, guidance and tools which meet their needs in a form and language they can understand, and channel they can use effectively","Ease of access to advice services, either in person or by telephone ","How easy or difficult is it for you to do each of the following things?\nCHOOSE ONE ONLY FOR EACH\n-Get to a Citizens Advice Bureau or other advice agency using your normal forms of transport\n-Get to a Jobcentre Plus or local benefit office using your normal forms of transport\n-Use a telephone in private to discuss financial matters\n-Receive confidential financial information by post\n\n1.Very easy\n2.Quite easy\n3.Quite difficult\n4.Very difficult\n5.Unable to go\n6.Do not wish to go","N",34]
[null,"Exposure and access to financial products ","Access to appropriate financial products which meet their needs via appropriate channels","Ease of access to banking services, either in person or my mail","How easy or difficult is it for you to do each of the folllowing things?\nCHOOSE ONE ONLY FOR EACH\n- Get to a Post Office using your normal forms of transport\n- Get to a Cash point using your normal forms of transport\n- Get to a Bank, building society or credit union using your normal forms of transport\n- Receive confidential financial documents by post, such as a payment card or chequebook\n\n1.Very easy\n2.Quite easy\n3.Quite difficult\n4.Very difficult\n5.Unable to go\n6.Do not wish to go","N",35]
[null,"Exposure and access to financial products ","Access to appropriate financial products which meet their needs via appropriate channels","Types of banking products held","Which of the following types of everyday accounts do you have, if any, either in your own name or jointly with someone else? These might be held with a bank, building society or other provider such as a credit union or post office. \nCHOOSE ALL THAT APPLY\n1. Current account (usually offered with an overdraft facility, even if you don't want one)\n2. Basic Bank Account (normally without an overdraft facility)\n3. Post Office Card Account (for receiving your pension, benefits or tax credits) \n4. A saving deposit account (e.g. an instant access or notice account, including cash ISA)\n5. None of these","N",36]
[null,"Exposure and access to appropriate financial advice and guidance","Digital access to financial advice, guidance and tools ","Use of the internet to access information about money and finances ","In which of the following ways, if any, can or do you use the internet when you need to access information about money or your finances?\nCHOOSE ALL THAT APPLY\n1. At home, using a computer or laptop\n2. At home, using a mobile phone, tablet or internet-enabled TV\n3. At work, college or at a friend or relative's home\n4. In a library, community centre or other public setting\n5. Somewhere else\n6. Do not use the internet","N",37]
[null,"Exposure and access to appropriate financial advice and guidance","Digital access to financial products and services ","Willingness to use the internet to carry out day to day banking","To what extent do you agree or disagree with the following statement:\n\nI would be happy to use the Internet to carry out day to day banking transactions","Y",38]
[null,"Attitudes to  credit use",0,"Preference for saving up rather than borrowing money","I am now going to read you some things that other people have said about managing money. Please tell me how strongly you agree or disagree with them.\n - I hate to borrow – I would much rather save up in advance","Y",39]
[null,"Belief that money advice and guidance can help them",0,"Likelihood of seeking money advice and guidance","How likely are you to take advice about dealing with money issues from a free advice organisation to deal with money worries? This could include Citizen's Advice Bureau, Money Advice Service or StepChange.\n\nCHOOSE ONE ONLY\n\n1. Very likely\n2. Fairly likely\n3. Fairly unlikely\n4. Very unlikely\n5. Don’t know\n","N",40]
[null,"Belief that money advice and guidance can help them",0,"Attitude towards money advice and guidance ","How much do you agree or disagree with each of the following statements? When we say advice and guidance, we mean from organisations like Citizen's Advice Bureau, Money Advice Service or StepChange and also from accountants and independent financial advisers\n\n• Asking for financial advice and guidance seems too scary \n• I’d feel embarrassed to take financial advice and guidance\n• I’d make better financial decisions with financial advice and guidance\n• I can sort out my own money issues, without financial advice and guidance\n• When it comes to things like bank accounts, credit cards or insurance, there’s not enough information out there I can trust\n","N",41]
[null,"Confidence questioning or challenging financial advice they are given","\n","Confidence talking to professionals about money","How confident would you feel talking to people who can give you advice about money\n\n1.Very confident \n2. Fairly confident \n3. Not very confident \n4. Not at all confident\n5. Don't know\n","N",42]
[null,"Saving mindset ","Understand the value of saving for an unexpected event ","Perceived importance of saving for a rainy day","Thinking overall about your finances, how important do you think it is to save for a rainy day \n\n1. Very important\n2. Fairly important\n3. Neither important nor unimportant\n4. Fairly unimportant\n5. Very unimportant\n6. Don’t know","Y",43]
[null,"Saving mindset ","Recognise the importance of future financial needs in retirement","Perceived importance of putting money aside for retirement","How important do you think it is to put money aside for your retirement\n\n1. Very important\n2. Fairly important\n3. Neither important nor unimportant\n4. Fairly unimportant\n5. Very unimportant\n6. Don’t know","Y",44]
[null,"Saving mindset ","Motivated to keep track of finances ","Perceived importance of keeping track of income and expenditure ","How important do you think it is to keep track of your household’s income and expenditure \n\n1. Very important\n2. Fairly important\n3. Neither important nor unimportant\n4. Fairly unimportant\n5. Very unimportant\n6. Don’t know\n","Y",45]
[null,"Saving mindset ","Understand the value of making their money go further by shopping around","Perceived importance of shopping around","How important do you think it is to shop around in order to make your money go further \n\n1. Very important\n2. Fairly important\n3. Neither important nor unimportant\n4. Fairly unimportant\n5. Very unimportant\n6. Don’t know","Y",46]
[null,"Saving mindset ","Understand the value of making their money go further by shopping around","Attitude to switching suppliers ","Q3\nAnd how much do you agree or disagree with each of the following statements?:\n- I prefer to stick with one company over time rather than keep changing suppliers*\n• There's no point switching things like insurance, energy or bank accounts, it's not worth the hassle\n\n1. Strongly agree\n2. Tend to agree\n3. Neither agree nor disagree\n4. Tend to disagree\n5. Strongly disagree\n6. Don’t know\n","N",47]
[null,"Financial confidence","Confident managing money","Level of confidence in managing money","How confident do you feel about managing your money?  \n\nPlease answer on a scale of 0 to 10, where 0 is ‘not at all confident and 10 is ‘very confident\n 0…10 scale\nDon't know\n","Y",48]
[null,"Financial confidence","Confident choosing appropriate products/services","Level of confidence in choosing appropriate products/services","How confident do you feel making decisions about financial products and services?  \n\nPlease answer on a scale of 0 to 10, where 0 is ‘not at all confident and 10 is ‘very confident\n 0…10 scale\nDon't know\n","Y",49]
[null,"Financial confidence","Confident keeping track of income and expenditure","Perceived quality of approach to keeping track of income and expenditure","Thinking overall about your (and your partner/spouse’s) approach to keeping track of income and expenditure, how well do you think this approach works?\n\nPlease answer on a scale of 0 to 10, where 0 means not at all well and 10 means very well\n\n0…10 scale\nDon't know","N",50]
[null,"Financial confidence","Confident exercising their own judgment in financial decisions and to question\nsuggestions and advice","Level of confidence dealing with companies and making purchases ","How much do you agree or disagree with the following statement?  \n \n- When dealing with companies or making purchases, I would consider myself to be a confident and savvy customer\n \n\n1. Strongly agree\n2. Tend to agree\n3. Neither agree nor disagree\n4. Tend to disagree\n5. Strongly disagree\n6. Don’t know\n","N",51]
[null,"Financial confidence","Confident exercising their own judgment in financial decisions and to question\nsuggestions and advice","Level of confidence making decisions about pensions","How much do you agree or disagree with each of the following statements?  \n \n - I know enough about pensions to decide with confidence  how to save for my retirement \n - Sometimes pensions seem so complicated that I cannot really understand the best thing to do \n - Dealing with pensions scares me \n\n1. Strongly agree\n2. Tend to agree\n3. Neither agree nor disagree\n4. Tend to disagree\n5. Strongly disagree\n6. Don’t know","N",52]
[null,"Financial confidence","Confident communicating about their situation and needs with financial\nservices professionals.","Level of confidence talking to advice providers ","How confident would you feel talking to people who can give you advice about money\n\n1.Very confident \n2. Fairly confident \n3. Not very confident \n4. Not at all confident\n5. Don't know\n","N",53]
[null,"Belief in own ability to improve or maintain their financial situation",0,"Extent of feeling in control of financial situation\n","How much do you agree or disagree with each of the following statements?  \n \n - I feel in control of my finances\n\n1. Strongly agree\n2. Tend to agree\n3. Neither agree nor disagree\n4. Tend to disagree\n5. Strongly disagree\n6. Don’t know\n \n","N",54]
[null,"Self-controlled spending ",0,"Frequency of buying on impulse","O4 To what extent would you say the following statements apply to you personally?\n\nA) I often buy things on impulse\n\n0 does not sound like me\n...\n10 sounds a lot like me\nDon't know\nNot applicable","Y",55]
[null,"Self-controlled spending ",0,"Ability to resist pressures to spend","O4 To what extent would you say the following statements apply to you personally?\n\nB) I feel under pressure to spend like my friends even when I can’t afford it.0 (does not sound like me at all) to 10 (sounds a lot like me)  \n\n\n0 does not sound like me\n...\n10 sounds a lot like me\nDon't know\nNot applicable","Y",56]
[null,"Financial engagement",0,"Extent of engagement with finances ","To what extent do you agree or disagree with the\nstatement \n\n\"I prefer to live for today and let tomorrow take care of itself\" \n \"Nothing I do will make much difference to my financial situation\"\n\"I am too busy to sort out my finances at the moment\"\n\n1. Strongly agree\n2. Tend to agree\n3. Neither agree nor disagree\n4. Tend to disagree\n5. Strongly disagree\n6. Don’t know\n","Y",57]
[null,"Adaptable to changing financial circumstances ",0,"Willingness to adjust non-essential spending"," I am prepared to adjust the amount of money I spend on non-essentials if my life changes: 0 (does not sound like me at all) to 10 (sounds a lot like me)\n\n0…10 scale\nDon't know","Y",58]
[null,"Willing to talk openly and honestly about money with friends and family",0,"Willingness to talk about money with friends and family\n","How much do you agree or disagree with each of the following statements?  \n\n - I would be too embarrassed to discuss my financial situation\n \n- I would talk to family and friends before making an important financial decision\n\n1. Strongly agree\n2. Tend to agree\n3. Neither agree nor disagree\n4. Tend to disagree\n5. Strongly disagree\n6. Don’t know\n","N",59]
[null,"Attitudes to the future ","Recognise the importance of balancing their future financial needs with their current financial needs ","Preference for saving for the future rather than spending now","How much do you agree or disagree with each of the following statements?  \n\n - I find it more satisfying to spend money than to save it for the long term \n - If I had to choose, I would rather have a good standard of living today than save for the future.\n\n1. Strongly agree\n2. Tend to agree\n3. Neither agree nor disagree\n4. Tend to disagree\n5. Strongly disagree\n6. Don’t know\n","N",60]
[null,"Attitudes to the future ","Anticipate and plan for future financial needs including less positive scenarios ","Extent of plans for funding future care needs ","Have you thought about or made any plans for how you might fund the care and support you may need as you get older? This might include in-home support or a care home.\nCODES 3,4,5,6 CAN BE MULTICODE\n1. I haven't really thought about it\n2. I've thought about it but haven’t done anything specific\n3. I’m saving money which could pay for this (e.g. savings, pension or investments)\n4. I’ve taken out insurance cover to pay for this (e.g. long-term care plan)\n5. I could sell property to pay for this\n6. I hope my family would help fund this\n7. Other (please specify)\n8. Don't know","N",61]
[null,"Attitudes to the future ","Anticipate and plan for future financial needs including less positive scenarios ","Extent of plans for coping with income loss due to changes in tax or benefits","Have you thought about or made any plans for how you might cope financially with an unexpected fall in your or your household’s income because of changes in tax or benefits?\nCODES 3,4,5,6 CAN BE MULTICODE\n1. I haven't really thought about it\n2. I've thought about it but haven’t done anything specific\n3. I’m saving money which could pay for this (e.g. savings, pension or investments)\n4. I could sell property to pay for this\n5. I hope family would help fund this\n6. Other (please specify)\n7. Don't know\n\n","N",62]
[null,"Attitudes to the future ","Anticipate and plan for future financial needs including less positive scenarios ","Extent of plans for coping with income loss due to redundancy or ill health","Have you thought about or made any plans for how you might cope financially with an unexpected fall in your or your household’s income because of redundancy or ill-health?\nCODES 3,4,5,6,7 CAN BE MULTICODE\n1. I haven't really thought about it\n2. I've thought about it but haven’t done anything specific\n3. I’m saving money which could pay for this (e.g. savings, pension or investments)\n4. I’ve taken out insurance to pay for this \n5. I could sell property to pay for this\n6. I hope family would help fund this\n7. Other (please specify)\n8. Don't know\n","N",63]
[null,"Attitudes to the future ","Anticipate and plan for future financial needs including less positive scenarios ","Extent of plans for coping with a rise in mortgage repayments","ONLY IF HAVE A MORTGAGE: 35. Have you thought about or made any plans for how you might cope financially if interest rates rise and your or your household’s mortgage repayments increase?\nCODES 3,4,5,6,7 CAN BE MULTICODE\n1. I haven't really thought about it\n2. I've thought about it but haven’t done anything specific\n3. I’m saving money which could pay for this (e.g. savings, pension or investments)\n4. I would switch to a new mortgage deal\n5. I could sell property to pay for this\n6. I hope family would help fund this\n7. Other (please specify)\n8. This won’t affect me – I’m on a fixed rate mortgage\n9. Don't know\n","N",64]
[null,"Financial numeracy","Understand financial concepts and are able to answer basic questions around\ninterest rates","Ability to calculate interest earned from savings\n","QUIZ Suppose you put £100 into a savings account with a guaranteed interest rate of 2% per year. You don’t make any further payments into this account and you don’t withdraw any money.\n\nHow much would be in the account at the end of the first year, once the interest payment is made?\n","Y",65]
[null,"Financial numeracy","Understand financial concepts and are able to answer basic questions around\ninterest rates","Ability to calculate interest owed on a loan","QUIZ You have taken out a loan for £500, and the interest rate you are charged is 10 percent per month. There are no other fees. At this interest rate, how much money would you owe in total after one month?\n\nA £505\nB £550\nC £510\nD £600\n","N",66]
[null,"Financial numeracy","Understand financial concepts and are able to answer basic questions around\ninflation","Understanding of the impact of inflation on buying power","QUIZ If the inflation rate is 5% and the interest rate you get on your savings is 3%, will your savings have more, less or the same amount of buying power in a year’s time?\n1. More\n2. The same\n3. Less\n4. Don’t know","Y",67]
[null,"Understand financial concepts and products  ","Understand different loan types and interest on borrowing","Understanding of loan types and calculating interest","STEM Which of these statements best describes how knowledgeable you feel about: \n\n- comparing different loans and credit cards\n- credit unions \n- calculating the total cost of a loan or credit such as Brighthouse or a car on hire purchase (including interest and charges)  \n\n1. I have an excellent knowledge\n2. I have a good knowledge\n3. I have a basic knowledge\n4. I know nothing about this\n5. Not applicable","N",68]
[null,"Understand financial concepts and products  ","Understand different loan types and interest on borrowing","Understanding of APR","QUIZ I would like to know whether you think the following statements are true or false.....\n\n - For a six month loan, it will cost you more to borrow money on a loan with a low APR than a loan with a high APR\n\nTrue\nFalse\nDon't know","N",69]
[null,"Understand financial concepts and products ","Understand investments ","Understanding of investments \n\n","QUIZ I would like to know whether you think the following statements are true or false.....\n\n - An investment with a high return is likely to be low risk\n - It is usually possible to reduce the risk of investing in the stock market by buying a wide range of stocks and shares. \n\nTrue\nFalse\nDon't know","N",70]
[null,"Understanding financial concepts, products and situations","Understand bank accounts ","Knowledge of bank accounts and ability to check bank balance","STEM: Which of these statements best describes how knowledgeable you feel about: \n\n- bank accounts\n- checking the balance on your bank account\n\n1. I have an excellent knowledge\n2. I have a good knowledge\n3. I have a basic knowledge\n4. I know nothing about this\n5. Not applicable","N",71]
[null,"Understanding financial concepts, products and situations","Understand different insurance products and can assess which options are right for them","Understanding of insurance and ability to compare insurance products\n","STEM: Which of these statements best describes how knowledgeable you feel about: \n\n- insurance\n- comparing different types of insurance\n\n1. I have an excellent knowledge\n2. I have a good knowledge\n3. I have a basic knowledge\n4. I know nothing about this\n5. Not applicable","N",72]
[null,"Understanding financial concepts, products and situations","Understand different types of savings vehicles, and can assess which options are right for them","Understanding of savings accounts and ability to compare savings products","STEM: Which of these statements best describes how knowledgeable you feel about: \n- savings accounts \n- credit unions \n- comparing savings products  \n1. I have an excellent knowledge\n2. I have a good knowledge\n3. I have a basic knowledge\n4. I know nothing about this\n5. Not applicable","N ",73]
[null,"Understanding financial concepts, products and options relevant to their issue, life stage or event","Understand concepts, products and options relavent to their pension","Knowledge of pensions, ability to check and make decisions about pensions\n\n","STEM: Which of these statements best describes how knowledgeable you feel about: \n- pensions\n- checking how much pension income you will get when you retire\n- making decisions about a pension to give you an income you require in retirement \n1. I have an excellent knowledge\n2. I have a good knowledge\n3. I have a basic knowledge\n4. I know nothing about this\n5. Not applicable","N",74]
[null,"Understanding financial concepts, products and options relevant to their issue, life stage or event","Understand concepts, products and options relevant to their mortgage","Understanding of mortgages and mortgage repayments ","STEM: Which of these statements best describes how knowledgeable you feel about:  \n- mortgages\n- applying for a mortgage\n- calculating you monthly mortgage repayments if interest rates rise\n1. I have an excellent knowledge\n2. I have a good knowledge\n3. I have a basic knowledge\n4. I know nothing about this\n5. Not applicable","N ",75]
[null,"Understanding financial concepts, products and options relevant to their issue, life stage or event","Understand concepts, products and options relevant to problem debt","Knowledge of options and rights in relation to problem debt","STEM: Which of these statements best describes how knowledgeable you feel about:  \n- the different options for sorting out debt problems\n- the fees charged for debt solutions such as bankruptcy, Debt Relief Orders and Debt Management Plans\n- the steps I should take if I’m unable to pay my debts \n- my rights when companies try to recover money I owe them\n- the steps companies can take to recover the money I owe them\n1. I have an excellent knowledge\n2. I have a good knowledge\n3. I have a basic knowledge\n4. I know nothing about this\n5. Not applicable\n\n\n","N",76]
[null,"Knowledge of where to go for advice, guidance and tools about their financial situation, in person, by phone and using digital resources",0,"Awareness of different advice providers ","Which, if any, of these providers of advice on your money you have ever heard of, even if you’re not very familiar with them?\n\nSELECT ALL THAT APPLY\n\n1. Money Advice Service\n2.Citizen’s Advice Bureau\n3.Money Sense\n4.Which?\n5.Money Saving Expert (Martin Lewis)\n6.Other price comparison sites (e.g. Moneysupermarket, Comparethemarket)\n7.Directgov (gov.co.uk)\n8. Consumer Credit Counselling Service (CCCS)/StepChange\n9. National Debtline\n[ADD OTHER RELEVANT ORGANISATIONS/SITES]\n11. None of these\n","N",77]
[null,"Knowledge of where to go for advice, guidance and tools about their financial situation, in person, by phone and using digital resources",0,"Knowledge of how to access money advice","STEM: Which of these statements best describes how knowledgeable you feel about:  \n- where to get  advice if you need help with your finances\n\n1. I have an excellent knowledge\n2. I have a good knowledge\n3. I have a basic knowledge\n4. I know nothing about this\n5. Not applicable","N",78]
[null,"Understanding financial concepts, products and situations","Understand the main types of financial fraud and how to protect themselves from it","Knowledge about types of fraud and ability to protect from fraud ","STEM: Which of these statements best describes how knowledgeable you feel about:  \n- different types of financial fraud/scams \n- protecting yourself from financial fraud / scams\n- protecting yourself from online financial fraud / scams\n\n1. I have an excellent knowledge\n2. I have a good knowledge\n3. I have a basic knowledge\n4. I know nothing about this\n5. Not applicable\n","N ",79]
[null,"Understanding money management","Understand the principles of budgeting and can develop a budget suited to their needs","Ability to create a weekly or monthly budget ","STEM: Which of these statements best describes how knowledgeable you feel about: \n- creating a weekly or monthly household budget\n\n1. I have an excellent knowledge\n2. I have a good knowledge\n3. I have a basic knowledge\n4. I know nothing about this\n5. Not applicable\n","N ",80]
[null,"Understanding money management","Knowing how to make their money go further","Ability to use a price comparison site ","STEM: Which of these statements best describes how knowledgeable you feel about: \n - using a price comparison website \n\n1. I have an excellent knowledge\n2. I have a good knowledge\n3. I have a basic knowledge\n4. I know nothing about this\n5. Not applicable\n\n","N",81]
[null,"Understanding money management","Knowing how to make their money go further","Ability to check benefits entitlements and tax payments","STEM: Which of these statements best describes how knowledgeable you feel about: \n- checking you’re getting all benefits you are entitled to\n- checking you’re paying the correct amount of tax\n\n1. I have an excellent knowledge\n2. I have a good knowledge\n3. I have a basic knowledge\n4. I know nothing about this\n5. Not applicable\n\n","N",82]
[null,"Basic skills: Literacy","People have the level of literacy needed to fill in forms and read information about financial products in English (or Welsh in Wales)","Level of literacy ","And how good are you at each of the following:\n\na)  writing in English when you need to in daily life? For example: writing letters or notes or filling in official forms?\nb) reading in English when you need to? For example\nreading newspapers and magazines or reading letters, paperwork or forms?\n\n1. Very good \n2. Fairly good \n3. Below average \n4. Poor \n5. No opinion. \n6, Don't Know  ","N",83]
[null,"Basic skills: Digital Literacy","Able to use financial/money-related online services eg. forms, tools, emails, and online banking\n","Ability to carry out financial tasks and transactions online ","A) Do you access to the internet at home or elsewhere?\nYes\nNo\nDon't know\n\nIF DO HAVE ACCESS\nB) STEM I’d like you to think about different commercial transactions people do in their everyday lives like banking or shopping. How how knowledgeable you feel about: \na) Buying a product online\nb) Making travel reservations/bookings\nc) Paying bills\nd) Using your bank’s online services\ne) Comparing products and services\nf) Ordering groceries or food online\ng) Selling things online\nh) Finding the location of a house,  office, store or restaurant \n\n1. I have an excellent knowledge\n2. I have a good knowledge\n3. I have a basic knowledge\n4. I know nothing about this\n5. Not applicable","N",84]
[null,"Basic skills: Digital Literacy","Able to navigate online content and locate the information they need","Ability to use the internet","How would you rate your ability to use the\nInternet?\n1. Excellent\n2. Good\n3. Fair\n4. Poor\n5. Bad\n6. Don’t know","N",85]
[null,"Basic skills:Digital literacy","Able to navigate online content and locate the information they need","Ability to find information online\n\n","To what extent do you agree or disagree with the following statements?\n\n- When I need information the first place I look is the internet\n - I find it easy to find what I am looking for online\n - I would rather look at information in a paper leaflet than on a company’s website\n\nStrongly Agree\nTend to Agree\nTend to disagree\nStrongly  disagree\nDon’t know\nDoes not apply to me\n ","N",86]
[null,"Basic skills: Communication","Able to confidently interact with others in English (or Welsh in Wales)","Ease of communicating in English or (Welsh in Wales)  ","Can I check, is English your first language?  Yes/No\n\n[IF NO]  So can I check would you have any difficulty speaking in English to a member of staff in a bank about choosing a financial product?\n1. Yes\n2. No\n\nIF IN WALES: \nCan I check, is English or Welsh your first language?  \nYes - English\nYes - Welsh\nNo, neither\n\n[IF NEITHER]  So can I check would you have any difficulty speaking in English or Welsh to a member of staff in a bank about choosing a financial product?\n1. Yes\n2. No","N",87]
[null,"Income","Employment status","Standard question","Thinking about your employment, what is your current status?\n\nSELECT ONE ONLY\nIF MORE THAN ONE APPLIES, SELECT MAIN STATUS\nIF ON MATERNITY LEAVE FROM EMPLOYER AND PLANNING ON RETURNING COUNT THIS AS WORKING\n1. Working for an employer full-time (that is for 30 or more hours per week)\n2. Working for an employer part-time (that is for less than 30 hours per week)\n3. Self-employed (with or without workers)\n4. Unemployed and looking for work\n5. Unemployed and not looking for work\n6. Retired\n7. Student\n8. Permanently sick / disabled\n9. Temporarily sick \n10. Looking after home\n11. Other \n","N",88]
[null,"Income",0,"Fincap P4","A) Which of the following sources of income, if any, do you currently have? Please include any income you receive personally or jointly with your partner or spouse. \nCHOOSE ALL THAT APPLY  \n1. Income from employment/self-employment (including sick pay)\n2. Income from personal or occupational pensions\n3. Income from savings/investments\n4. Rent you receive from boarders or lodgers (not family members) or other property you rent out or sublet\n5. Child maintenance payments\n6. Other types of payments or maintenance from parents or other family members who you do not live with, including as regular gifts\n7. None of these (SINGLE CODE ONLY)\n8. Don’t know  (SINGLE CODE ONLY)\n9. Prefer not to say  (SINGLE CODE ONLY)\n\nB) And which of the following sources of income do you currently have, if any?\nCHOOSE ALL THAT APPLY  \n1. State Pension\n2. Pension Credit\n3. Child benefit\n4. Universal Credit\n5. Working Tax Credits\n6. Job Seekers Allowance (JSA) \n7. Employment and Support Allowance (ESA)\n8. Income Support \n9. Housing benefit\n10. Council Tax Reduction\n11. Disability Living Allowance (DLA), Personal Independence Payment (PIP) or Attendance Allowance (AA)\n12. Carers Allowance\n13. Something else \n14. None of these (SINGLE CODE ONLY)\n15. Don't know (SINGLE CODE ONLY)\n16. Prefer not to say (SINGLE CODE ONLY)","N",89]
[null,"Income",0,"Fincap P1","Which band from the grid below does your household’s total gross income from all sources fall into?\n[INCOME is any money from work, including a second job or occasional work, and any other sources, such as benefits, pensions, savings and investments, maintenance payments and rent from property or subletting.]\nGROSS means the amount you receive before any deductions, income tax, National Insurance etc. \nCHOOSE ONE ONLY\n Per Week Per Month Per Year\n1. Up to £86 Up to £374 Under £4,500\n2. £87 - £124 £375 - £541 £4,500 - £6,499\n3.  £125 - £143 £542 - £624 £6,500 - £7,499\n4.  £144 - £182 £625 - £791 £7,500 - £9,499\n5. £183 - £220 £792 - £957 £9,500 - £11,499\n6. £221 - £259 £958 - £1,124 £11,500 - £13,499\n7.  £260 - £297 £1,125 - £1,291 £13,500 - £15,499\n8.  £298 - £336 £1,292 - £1,457 £15,500 - £17,499\n9.  £337 - £384 £1,458 - £1,666 £17,500 - £19,999\n10.  £385 - £480 £1,667 - £2,082 £20,000 - £24,999\n11. £481 - £576 £2,083 - £2,499 £25,000 - £29,999\n12. £577 - £672 £2,500 - £2,916 £30,000 - £34,999\n13. £673 - £768 £2,917 - £3,332 £35,000 - £39,999\n14. £769 - £961 £3,333 - £4,166 £40,000 - £49,999\n15 £962 - £1,441 £4,167 - £6,249 £50,000 - £74,999\n16.  £1,442 - £1,922 £6,250 - £8,332 £75,000 - £99,999\n17. £1,923+ £8,333+ £100,000+\n18. Don’t know\n19. Prefer not to say ","N",90]
[null,"Income",0,"X","POST\nBy how much has your income increased since [REFERENCE POINT]?\n1. ENTER AMOUNT IN £\n2. Stayed the same\n3. Has fallen\n4. Don't know\n5. Prefer not to say","N",91]
[null,"Income",0,"Fincap P3","Which one of these best applies to you personally?\n1. Pay income tax at a basic rate\n2. Pay income tax at a higher rate\n3. Do not pay income tax\n4. Don’t know\n5. Prefer not to say","N",92]
[null,"Savings",0,"Fincap G5","A) Approximately how much, if anything, do you personally have in savings and investments? Please do not include any money that you have saved in a pension. \n1. ENTER EXACT AMOUNT\n2. I do not have any savings and investments\n3. Don’t know \n4. Prefer not to say \n\nB) Could you estimate the total within the following bands?\nCHOOSE ONE ONLY\n1. £100 or less\n2. £101 - £500\n3. £501 - £1,000\n4. £1,001 - £9,999\n5. £10,000 - £19,999\n6. £20,000 or more\n7. Don’t know\n8. Prefer not to say ","N",93]
[null,"Savings",0,"PDL Qsav","Please can you tell me whether you currently have money saved in any of the following types of savings accounts and investments, including any joint accounts? CHOOSE ALL THAT APPLY\n1. A savings or deposit account with a bank or building society\n2. An account with a Credit Union\n3. Cash ISA\n4. Premium bonds\n5. Stocks and shares\n6. Other savings products\n7. Other investment product (not including pension)\n8. None of these (SINGLE CODE ONLY)\n9. Don't know (SINGLE CODE ONLY)\n10. Prefer not to say (SINGLE CODE ONLY)","N",94]
[null,"Other assets",0,"ELSA IAPROP and SEG N6","A) Which, if any, of these assets do you have, not including your own home? Please include any in your sole name or jointly owned with someone else\nCHOOSE ALL THAT APPLY. \n1. Houses, flats or holiday homes, including timeshares (not including this home) \n2. Farm or Business Property (such as a shop, warehouse or garage) \n3. Other land \n4. Cars, motorbikes, boats and other motor vehicles\n5. Money owed to you by others \n6. Money held in a trust \n7. Art, antiques, collectables, jewellery, and other valuables\n8. Other assets\n9. None of these (SINGLE CODE ONLY)\n10. Don't know (SINGLE CODE ONLY)\n11. Prefer not to say (SINGLE CODE ONLY)\n\nB) How much, in total, do you think they are currently worth? We only need your best estimate if you are unsure. \nCHOOSE ONE ONLY\n1. Less than £30,000 \n2. £30,000 to £39,999\n3. £40,000 to £49,999\n4. £50,000 to £74,999\n5. £75,000 to £99,999\n6. £100,000 to £149,999\n7. £150,000 to £199,999\n8. £200,000 to £249,999\n9. £250,000 to £500,000\n10. £500,000+\n11. Don't know (SINGLE CODE ONLY)\n12. Prefer not to say (SINGLE CODE ONLY)","N",95]
[null,"Other assets",0,"WAS Ten1\nSEG F21\nWAS Hvalue","A) In which of these ways do you (and your household) occupy your home?\n1. Own it outright\n2. Buying it with the help of a mortgage or loan\n3. Pay part rent and part mortgage (shared ownership)\n4. Rent it\n5. Live here rent-free (including rent-free in relative's/friend's property; excluding\nsquatting)\n6. Squatting\n\nB) And how much in total is left to pay on your mortgage (or mortgages, if you have more than one). If you are unsure, please give your best estimate.\nCHOOSE ONE ONLY\n1. Less than £10,000\n2. £10,000 to £19,999\n3. £20,000 to £29,999\n4. £30,000 to £39,999\n5. £40,000 to £49,999\n6. £50,000 to £74,999\n7. £75,000 to £99,999\n8. £100,000\n9. to £149,999\n10. £150,000 to £199,999\n11. £200,000 to £249,999\n12. £250,000 to £299,999\n13. £300,000 to £399,999\n14. £400,000 to £499,999\n15. £500,000 or more\n16. Don't know\n17. Prefer not to say\n\nC) About how much would you expect to get (in total and not just your share) for your current home if you sold it today (before paying off any outstanding mortgage or loan on the property)?\nCHOOSE ONE ONLY\nENTER AMOUNT IN £s  If DK, then asked banded question: \n1. Less than £60,000\n2. £60,000 to £99,999\n3. £100,000 to £149.999\n4. £150,000 to £199,999\n5. £200,000 to £249,999\n6. £250,000 to £299,999\n7. £300,000 to £349,999\n8. £350,000 to £399,999\n9. £400,000 to £499,999\n10. £500,000 to £749,999\n11. £750,000 to £999,999\n12. £1 million or more ","N",96]
[null,"Access to affordable credit ",0,"HCC 8.9","Please can you tell me which of the following you have had in the last [3 months], whether in your own name or jointly with someone else? Please include any that you are in arrears with.\n1. Credit or store card\n2. Overdraft \n3. Payday loan\n3. Loan from company that collects payments from your home (e.g. Provident, Greenwoods)\n5. Loan from a pawnbroker\n7. Loan from a Credit Union or other community finance organisation\n8. A loan from a friend or relative.\n9. Loan from the Social Fund\n10. Loan from an unlicensed lender who charges interest, sometimes called a loan shark\n11. Any other type of loan from a bank, building society or finance company e.g. Norton Finance, Blackhorse car finance\n11) Something else\n12) Don't know\n13) Prefer not to say","N",97]
[null,"Committed expenditure","Additional outgoings","Number of additional high-value monthly outgoings","Do you (and your partner if you have one) regularly spend more than £200 a month on any of the following items? \nCHOOSE ALL THAT APPLY \n1. Travel to work\n2. Rent paid because you work away from home and cannot claim it back\n3. Child care\n4. School fees\n5. Care for someone else (including nursing home)\n6. Financial support to a partner, child or other family member who does not live with you\n7. None of these (SINGLE CODE ONLY)\n8. Don’t know (SINGLE CODE ONLY)\n9. Prefer not to say (SINGLE CODE ONLY)","N",98]
[null,"Committed expenditure","Additional outgoings","Number of additional high-value monthly outgoings that are more than budget allows for","Do you (and your partner if you have one) regularly spend more than you can afford on any of the following items? \nPLEASE SELECT ALL THAT APPLY \n1. Travel to work\n2. Rent paid because you work away from home and cannot claim it back\n3. Child care\n4. School fees\n5. Care for someone else (including nursing home)\n6. Financial support to a partner, child or other family member who does not live with you\n7. Paying off credit or store cards \n8. Paying for goods bought on hire purchase or mail order\n8. None of these (SINGLE CODE ONLY)","N",99]
[null,"Committed expenditure","Dependent children","Number of dependent children","How many children depend on you financially?","N",100]

{"sheet":"Question numbers","index":35,"n_rows":13,"n_cols":4,"rows_kept":13,"cut":false,"hidden":false,"merged":[]}
[]
["Wellbeing ","Current financial wellbeing* (1, 2, 3, 9, 4, 5, 6, 7, 8, 10, 21)\nNote - I've merged the two buttons on the old OF for clarity and alignment with BBS) ","Longer-term financial security* (11, 12, 17, 14, 13, 15, 16, 22) (Qs 18, 19, 20 are bovered by 13) \n\nNB - merge buttons into one button here also"]
["Behaviours","Managing well day-to-day*\nManaging credit use (23, 25, 26, 24, 27)\nNot borrowing for every day spending (35, 36, 37, 38. 39) \nActive saving (51)\nKeeping track (29, 30, 28?, 32, 31)  \nAdjusting spending (40,41?,42) \nShopping around (48) (NB 43-47 are now merged into 48) \nMaximising Income (49, 50) \nManaging bill payments (33,34)","Planning ahead for life events*\nWorking towards goals (55, 56, 54)  \nBuilding Resilience (52, 53)\nPlanning for retirement (59, 60, 61, 57,58)  ","Proactively seeking advice (62,63)"]
["Enablers and Inhibitors (Mindset) ","Financial confidence* (86-93)","Savings orientation* (81-85)","Digital engagement* (68, 69, 70, 71) NB 72 73 74 repeat these "]
[null,"Spending self-control* (94) NB 95-98 are mow part of bank in q 94 ","Engagement with the future *  (101, 109-112)  nb 102-103 duplicates of row 101, and question 108 was deleted as also too close to 101) ","Engagement with advice and guidance* (77, 78, 79, 75, 76, 80)"]
[null,"Engagement with money* (99-100)","Confidence for retirement * (104-106) ","Willing to talk about money (107)"]
[]
["Enablers and Inhibitors (Ability)","Financial Numeracy* (113, 114, 115) ","Understanding financial concepts and products (116-124 ;127-130) ","Knowledge of where to access advice (125 126) "]
[null,"Basic skills - literacy, digital, communication (131-135)"]
["Enablers and Inhibitors (Acccess)","Access to financial products (65, 66) ",null,"Access to advice and guidance (64, 67)"]
["Means and pressures","Income, savings, access to affordable credit (136-144)","Expenditure (145-147)"]
[]
[null,"NB - * indicates bank contains Building Block measures"]